{"text_format":"1","workbook":"xlsx","n_sheets":4,"sheets":["SAN","c1","c14","c15"],"not_rendered":{"charts":0,"images":2,"macros":1,"external_links":0,"defined_names":229,"comments":0,"pivot_tables":0},"unopened":[],"bounds":{"document_bytes":16777216,"sheet_cells":100000,"rows_first":2000,"rows_last":500,"rows_between":2000,"halvings":0,"cell_chars":16384,"cell_head_chars":4096},"cells_cut":0,"cells_raw":0,"read":"whole","date_system":"1900"}

{"sheet":"SAN","index":0,"n_rows":560,"n_cols":22,"rows_kept":560,"cut":false,"hidden":false,"merged":[[18,11,18,15],[19,11,19,15],[525,8,526,8],[525,9,526,9],[525,10,526,10],[525,11,526,11],[525,12,525,13],[523,0,523,12],[524,0,526,0],[524,1,526,1],[524,2,526,2],[524,3,524,13],[525,3,526,3],[525,4,526,4],[525,5,526,5],[525,6,526,6],[525,7,526,7],[508,5,509,5],[508,6,509,6],[508,7,509,7],[508,8,509,8],[508,9,509,9],[508,10,509,10],[505,0,505,10],[506,0,509,0],[506,1,509,1],[506,2,509,2],[506,3,506,11],[507,3,507,8],[507,9,507,10],[507,11,509,11],[508,3,509,3],[508,4,509,4],[469,9,471,9],[469,10,471,10],[469,11,471,11],[469,12,471,12],[470,6,471,6],[470,7,470,8],[467,0,467,11],[468,0,471,0],[468,1,471,1],[468,2,471,2],[468,3,468,10],[468,11,468,12],[469,3,471,3],[469,4,471,4],[469,5,471,5],[469,6,469,8],[445,0,446,0],[445,1,446,1],[445,2,445,3],[445,4,445,5],[324,14,325,15],[325,8,326,8],[325,9,326,9],[325,10,325,11],[451,9,453,9],[451,10,453,10],[451,11,453,11],[451,12,453,12],[452,6,453,6],[452,7,452,8],[449,0,449,11],[450,0,453,0],[450,1,453,1],[450,2,453,2],[450,3,450,10],[450,11,450,12],[451,3,453,3],[451,4,453,4],[451,5,453,5],[451,6,451,8],[384,16,390,16],[385,0,388,0],[385,1,388,1],[385,2,388,2],[385,3,388,3],[385,4,386,7],[323,4,323,9],[324,4,326,4],[324,5,326,5],[324,6,325,7],[324,8,324,11],[324,12,325,13],[387,4,387,5],[387,6,387,7],[262,6,262,7],[262,8,262,9],[262,10,262,11],[262,12,262,13],[262,14,262,15],[322,0,326,0],[322,1,326,1],[322,2,322,11],[323,2,326,2],[323,3,326,3],[258,1,258,3],[259,1,259,3],[262,0,263,0],[262,1,263,1],[262,2,262,3],[262,4,262,5],[251,1,251,3],[252,1,252,3],[253,1,253,3],[254,2,254,3],[255,1,257,1],[255,2,255,3],[256,2,256,3],[245,1,245,3],[246,2,246,3],[247,1,247,3],[248,2,248,3],[249,1,249,3],[250,2,250,3],[239,1,241,1],[239,2,239,3],[240,2,240,3],[241,2,241,3],[243,1,243,3],[244,2,244,3],[235,10,235,11],[235,12,235,13],[235,14,235,15],[235,16,235,17],[237,1,237,3],[238,1,238,3],[235,0,236,0],[235,1,236,3],[235,4,236,4],[235,5,236,5],[235,6,235,7],[235,8,235,9],[187,8,187,10],[188,8,188,10],[189,8,189,10],[191,0,192,0],[191,1,192,1],[191,2,191,3],[191,4,192,4],[191,5,191,9],[169,8,169,10],[171,8,171,10],[176,8,176,10],[181,8,181,10],[185,8,185,10],[186,8,186,10],[165,7,166,7],[165,8,166,10],[165,11,166,11],[165,12,165,13],[165,14,166,14],[165,15,166,15],[165,0,166,0],[165,1,166,1],[165,2,166,2],[165,3,165,4],[165,5,166,5],[165,6,166,6],[110,10,111,11],[111,5,111,6],[117,0,119,0],[117,1,119,1],[117,2,119,2],[117,3,117,5],[117,6,119,6],[118,3,119,3],[118,4,119,4],[118,5,119,5],[109,0,112,0],[109,1,112,1],[109,2,109,8],[109,9,109,11],[110,2,111,2],[110,3,111,4],[110,5,110,6],[110,7,111,7],[110,8,111,8],[110,9,111,9],[102,0,104,0],[102,1,104,1],[102,2,104,2],[102,3,102,5],[103,3,104,3],[103,4,104,4],[103,5,104,5],[95,9,97,9],[95,10,95,11],[96,3,97,3],[96,4,97,4],[96,5,97,5],[96,7,97,7],[96,8,97,8],[96,10,97,10],[96,11,97,11],[82,8,83,8],[95,0,97,0],[95,1,97,1],[95,2,97,2],[95,3,95,5],[95,6,97,6],[95,7,95,8],[81,0,83,0],[81,1,83,1],[81,2,83,2],[81,3,81,5],[81,6,83,6],[81,7,81,8],[82,3,83,3],[82,4,83,4],[82,5,83,5],[82,7,83,7]]}
[" ","Denumirea unitatii",null,null,null,null,"Numele persoanei care raspunde de informatiile inscrise in formular",null,null,null,null,null,null,"Dna/Dl Manager/Director",null,null,null,"Persoana care a completat, daca are semnatura digitala"]
[null,"For Tutelar",null,null,null,null,"Telefon"]
[null,"Judetul",null,null,null,null,"E- mail"]
[null,"Localitatea"]
[null,"Strada"]
[null,"Nr."]
[null,"Tip spital"]
[null,"Forma juridica"]
[null,"Forma de proprietate"]
[null,"Conducatorul unitatii",null,null,"ATENTIE !"]
[null,"Telefon",null,null,"Pentru colectarea corecta a datelor trebuie sa activati macrourile"]
[null,"Cod unitbz:",null,null,"In File-> Options-> Trust Center-> Trust Center Settings-> Macro settings->se bifeaza Enable VBA Macros se da click pe OK"]
[]
["Activitatea unităţilor sanitare în anul 2022"]
[]
["Cap.1  Numărul unităţilor sanitare și al unităților din sfera asistenței sociale în care se furnizeaza și îngrijiri medicale - la sfârşitul anului"]
["Nr. rând","Tipuri de unităţi sanitare","Total"]
["A","B","1",null,null,null,null,null,null,null,null,"Mesaje de eroare"]
["1.    ","Spitale (inclusiv institute cu paturi de spital)",0,null,null,null,null,null,null,null,null,"Numar de mesaje de eroare in sheet SAN",null,null,null,null,0]
["2.    ","Unități sanitare (inclusiv unități asimilate spitalelor) numai cu internare de zi*",0,null,null,null,null,null,null,null,null,"Numar de mesaje de eroare in sheet c15",null,null,null,null,0]
["3.    ","Centre de sănătate cu paturi de spital",0]
["4.    ","Centre de sănătate",0]
["5.    ","Centre de sănătate multifuncționale",0]
["6.    ","Centre de sănătate mintală",0]
["7.    ","Unităţi medico-sociale",0]
["8.    ","Sanatorii TBC",0]
["9.    ","Preventorii",0]
["10.    ","Sanatorii de nevroze sau de neuropsihiatrie",0]
["11.   ","Sanatorii balneare ",0]
["12.   ","Dispensare medicale ",0]
["13.   ","Cabinete medicale şcolare ",0]
["14.   ","Cabinete medicale studenţeşti",0]
["15.   ","Cabinete independente de medicină generală",0]
["16.   ","Cabinete independente de medicină de familie 1)  ",0]
["17.   ","Societăţi medicale civile 2)",0]
["18.   ","Farmacii",0]
["19.   ","Puncte de lucru ale farmaciilor",0]
["20.   ","Drogherii",0]
["21.   ","Depozite farmaceutice",0]
["22.   ","Policlinici",0]
["23.   ","Centre de dializă",0]
["24.   ","Puncte de lucru ale centrelor de dializă",0]
["25.   ","Centre de diagnostic şi tratament 3)",0]
["26.   ","Centre medicale de specialitate 2)",0]
["27.   ","Ambulatorii de specialitate 2)",0]
["28.   ","Ambulatorii integrate spitalului 4)",0]
["29.   ","Cabinete stomatologice şcolare ",0]
["30.   ","Cabinete stomatologice studenţeşti",0]
["31.   ","Cabinete stomatologice independente 1)",0]
["32.   ","Societăţi stomatologice civile medicale 1)",0]
["33.   ","Cabinete medicale independente de specialitate 1) ",0]
["34.   ","Societăţi civile medicale de specialitate 1)",0]
["35.   ","Centre de transfuzie sanguină",0]
["36.   ","Laboratoare medicale",0]
["37.   ","Laboratoare de tehnică dentară",0]
["38.   ","Unități de ambulanță, transportul pacienților și SMURD",0]
["39.   ","Alte tipuri de cabinete medicale",0]
["40.   ","Unitati rezidentiale pentru persoanele cu dizabilități",0]
["41.   ","Centre de zi pentru persoanele cu dizabilități",0]
["42.   ","Unități rezidențiale pentru persoanele vârstnice care oferă îngriji medicale în cadrul unității",0]
["43.   ","Alte unități de asistență socială care furnizează îngrijiri medicale",0]
["44.   ","Institute şi instituţii fără paturi",0]
["Cap.2  Numărul cabinetelor medicale și al săliilor de operații care funcţionează în structura unor unități sanitare"]
["Nr. rând","Tipuri de unităţi sanitare","Cabinete de medicină generală","Cabinete medicină de familie","Cabinete Stomatologice","Cabinete medicale de specialitate","Săli de operații"]
["A","B",1,2,3,4,5]
["1.","Spitale (inclusiv institute cu paturi de spital)",0,0,0,0,0]
["2.","Unități sanitare (inclusiv unități asimilate spitalelor) numai cu internare de zi*",0,0,0,0,0]
["3.","Centre de sănătate cu paturi de spital",0,0,0,0,0]
["4.","Centre de sănătate",0,0,0,0,0]
["5.","Centre de sănătate multifuncționale",0,0,0,0,0]
["6.","Centre de sănătate mintală",0,0,0,0,0]
["7.","Societăţi medicale civile",0,0,0,0,0]
["8.","Policlinici",0,0,0,0,0]
["9.","Centre de dializă și puncte ale centrelor de dializă",0,0,0,0,0]
["10.","Centre de diagnostic şi tratament",0,0,0,0,0]
["11.","Centre medicale de specialitate",0,0,0,0,0]
["12.","Ambulatorii de specialitate",0,0,0,0,0]
["13.","Ambulatorii integrate spitalului",0,0,0,0,0]
["14.","Societăţi stomatologice civile medicale",0,0,0,0,0]
["15.","Societăţi civile medicale de specialitate",0,0,0,0,0]
["Cap.3a  Numărul paturilor si al pacienţilor internati în unităţile sanitare"]
["Nr. rând","Tipuri de unităţi sanitare","Paturi pentru spitalizare continuă","Pacienți internaţi în regim continuu",null,null,"Paturi pt. cazuri de zi","Numărul cazurilor de zi"]
[null,null,null,"Total","d.c: femei","Om-zile  spitalizare",null,"Total","d.c: femei"]
[]
["A","B",1,2,3,4,5,6,7]
["1.    ","Spitale (inclusiv institute cu paturi de spital)",0,0,0,0,0,0,0]
["2.    ","Unități sanitare (inclusiv unități asimilate spitalelor) numai cu internare de zi*",0,0,0,0,0,0,0]
["3.    ","Centre de sănătate cu paturi de spital",0,0,0,0,0,0,0]
["4.    ","Centre de sănătate multifuncționale",0,0,0,0,0,0,0]
["5.    ","Unităţi medico-sociale",0,0,0,0,0,0,0]
["6.    ","Sanatorii TBC",0,0,0,0]
["7.    ","Preventorii",0,0,0,0]
["8.    ","Sanatorii de nevroze sau de neuropsihiatrie",0,0,0,0]
["9.    ","Sanatorii balneare ",0,0,0,0]
["Cap.3b  Numărul paturilor aferente posturilor de dializă și al pacienților tratați în centrele de dializă și în punctele de lucru ale centrelor de dializă"]
["Nr. rând","Tipuri de unităţi sanitare","Paturi aferente posturilor de dializă pentru spitalizare continuă","Pacienți dializați internați în regim continuu",null,null,"Paturi aferente posturilor de dializă pentru cazuri de zi","Numărul cazurilor de zi",null,"Paturi aferente posturilor de dializă pentru servicii ambulatorii","Numărul cazurilor de zi"]
[null,null,null,"Total","d.c: femei","Om-zile  spitalizare",null,"Total","d.c: femei",null,"Total","d.c: femei"]
[]
["A","B",1,2,3,4,5,6,7,8,9,10]
["1.    ","Centre de dializă",0,0,0,0,0,0,0,0,0,0]
["2.    ","Puncte de lucru ale centrelor de dializă",0,0,0,0,0,0,0,0,0,0]
["Cap.3c  Numărul paturilor și al pacienților din unitățile rezidențiale pentru persoanele cu dizabilitățisau pentru persoanele vârstnice în care se furnizează îngrijire medicală împreună cu îngrijire socială"]
["Nr. rând","Tipuri de unităţi sanitare","Paturi pentru persoane rezidente în unitate","Persoane rezidente"]
[null,null,null,"Total","d.c: femei","Om-zile  internare în unitatea rezidențială"]
[]
["A","B",1,2,3,4]
["1.    ","Unități rezidențiale pentru persoanele cu dizabilități",0,0,0,0]
["2.    ","Unități rezidențiale pentru persoanele vârstnice care oferă îngriji medicale în cadrul unității",0,0,0,0]
["Cap.3d Activitatea compartimentelor de terapie intensivă (TI) din spitale"]
["'Nr. rând","Tipuri de unităţi ","Paturi de terapie intensivă (TI)",null,null,null,null,null,null,"Utilizare paturi de terapie intensivă (TI)"]
[null,null,"Total paturi TI","Total paturi TI adulți",null,"din care:",null,"Total paturi TI neonatologie","Total paturi TI pediatrie","Om-zile spitalizare adulți în TI","Număr de zile cu rata de ocupare a paturilor TI pentru adulți peste***"]
[null,null,null,null,null,"paturi TI pentru îngrijire critică adulți"]
[null,null,"la 31 decembrie*","la 31 decembrie*","număr maxim (zilnic)**","la 31 decembrie*","număr maxim (zilnic)**","la 31 decembrie*","la 31 decembrie*","Total la sfârșitul anului","80%","95%"]
["A","B",1,2,3,4,5,6,7,8,9,10]
["1.","Spitale (inclusiv institute cu paturi de spital) și unități sanitare (inclusiv unități asimilate spitalelor) numai cu internare de zi ",{"$f":"+D115+H115+I115","v":0},0,0,0,0,0,0,0,0,0]
[]
["Cap.4  Numărul paturilor în unități sanitare (exclusiv paturile din unitățile pt. persoanele cu dizabilități și pt. Persoanele vârsnice), pe specialităţi "]
["Nr. rând","Specialităţi medicale","Total paturi pentru spitalizare continuă","Din total, paturi pentru spitalizare continuă",null,null,"Paturi pentru cazuri de zi"]
[null,null,null,"Paturi pentru copii","Paturi  pentru pacienți cu COVID-19","Paturi pentru bolnavi cronici"]
[]
["A","B","1",2,3,4,5]
["1.    ","TOTAL, din care:",{"$f":"SUM(C123:C164)-C124-C127-C134-C140-C143-C145-C146-C148-C149-C155-C163","v":0},{"$f":"SUM(D123:D164)-D124-D127-D134-D140-D143-D145-D146-D148-D149-D155-D163","v":0},0,0,0,{"$f":"IF((C86+C88+C91+C92+C93+C94)=(C122),\"OK\",\"Err\")","v":"OK"},{"$f":"IF((G86+G87+G88+G89+G100)=(G122),\"OK\",\"Err\")","v":"OK"}]
["2.    ","Interne, din care:",0,0,0,0,0]
["3.    ","     - pneumologie netuberculoasă",0,0,0,0,0]
["4.    ","Nefrologie",0,0,0,0,0]
["5.    ","Boli infecţioase, din care:",0,0,0,0,0,null,null,null,null," "]
["6.    ","     - HIV/SIDA",0,0,0,0,0]
["7.    ","Boli profesionale",0,0,0,0,0]
["8.    ","Cardiologie",0,0,0,0,0]
["9.   ","Cronici",0,0,0,0,0,{"$f":"IF(C130=F130,\"OK\",\"Err\")","v":"OK"}]
["10.   ","Dermato-venerologie",0,0,0,0,0]
["11.   ","Diabet zaharat, nutriţie şi boli metabolice",0,0,0,0,0]
["12.   ","Endocrinologie, din care:",0,0,0,0,0]
["13.   ","      - chirurgie endocrină",0,0,0,0,0]
["14.   ","Gastroenterologie",0,0,0,0,0]
["15.   ","Geriatrie şi gerontologie",0,0,0,0,0,{"$f":"IF(C136=F136,\"OK\",\"Err\")","v":"OK"}]
["16.   ","Hematologie",0,0,0,0,0]
["17.   ","Medicină generală",0,0,0,0,0]
["18.   ","Neonatologie, din care:",0,0,0,0,0,{"$f":"IF(C139=D139,\"OK\",\"Err\")","v":"OK"}]
["19.   ","     - prematuri",0,0,0,0,0,{"$f":"IF(C140=D140,\"OK\",\"Err\")","v":"OK"},{"$f":"IF(C140=F140,\"OK\",\"Err\")","v":"OK"}]
["20.   ","Neurologie",0,0,0,0,0]
["21.   ","Oncologie, din care:",0,0,0,0,0]
["22.   ","    -chirurgie oncologică",0,0,0,0,0]
["23.   ","Pediatrie, din care:",0,0,0,0,0,{"$f":"IF(C144=D144,\"OK\",\"Err\")","v":"OK"}]
["24.   ","    - recuperare pediatrică",0,0,0,0,0,{"$f":"IF(C145=D145,\"OK\",\"Err\")","v":"OK"},{"$f":"IF(C145=F145,\"OK\",\"Err\")","v":"OK"}]
["25.   ","    - pneumologie netuberculoasă",0,0,0,0,0]
["26.   ","Pneumologie, din care:",0,0,0,0,0]
["27.   ","     - pneumologie -TBC",0,0,0,0,0,{"$f":"IF(C148=F148,\"OK\",\"Err\")","v":"OK"}]
["28.   ","     - chirurgie toracică",0,0,0,0,0]
["29.   ","Psihiatrie",0,0,0,0,0]
["30.   ","Recuperare medicală fizică şi balneologie",0,0,0,0,0]
["31.   ","Recuperare neuro-psiho-motorie",0,0,0,0,0]
["32.   ","Reumatologie",0,0,0,0,0]
["33.   ","Chirurgie, din care:",0,0,0,0,0]
["34.   "," - chirurgie orală și maxilo-facială",0,0,0,0,0]
["35.   ","Neurochirurgie",0,0,0,0,0]
["36.   ","Obstetrică-ginecologie",0,0,0,0,0]
["37.   ","Oftalmologie",0,0,0,0,0]
["38.   ","ORL",0,0,0,0,0]
["39.   ","Ortopedie-traumatologie",0,0,0,0,0]
["40.   ","Urologie",0,0,0,0,0]
["41.   ","ATI (anestezie, terapie intensivă), din care:",0,0,0,0,0]
["42."," - destinate pacienților cu COVID-19",0,0,0,0,0]
[43,"Alte secţii",0,0,0,0,0]
["Cap.5  Numărul consultaţiilor de tip ambulator acordate pacienţilor, în unităţile sanitare"]
["Nr. Crt.","Tipuri de unităţi sanitare","Total consultaţii","din care, după domiciliul pacientului",null,"din col.1: consultatii platite de angajatori pt. personalul propriu","din col.1: tele-medicină","Nr.                            Crt.","Tipuri de unităţi sanitare",null,null,"Total consultaţii"," după domiciliul pacientului",null,"din col.1: consultatii platite de angajatori pt. personalul propriu","din col.1: tele-medicină"]
[null,null,null,"Urban","Rural",null,null,null,null,null,null,null,"Urban","Rural"]
["A","B","1","2","3",4,5,"A","B",null,null,"1","2","3",4,5]
[1,"TOTAL, din care:",{"$f":"SUM(D169:E169)","v":0},{"$f":"+D170+D173+D175+SUM(D177:D179)+D181+SUM(D183:D189)+SUM(M169:M171)+M173+M175+M177+SUM(M179:M189)","v":0},{"$f":"+E170+E173+E175+SUM(E177:E179)+E181+SUM(E183:E189)+SUM(N169:N171)+N173+N175+N177+SUM(N179:N189)","v":0},{"$f":"+F170+F173+F175+SUM(F177:F179)+F181+SUM(F183:F189)+SUM(O169:O171)+O173+O175+O177+SUM(O179:O189)","v":0},{"$f":"+G170+G173+G175+SUM(G177:G179)+G181+SUM(G183:G189)+SUM(P169:P171)+P173+P175+P177+SUM(P179:P189)","v":0},22,"Puncte de lucru ale centrelor de dializă",null,null,{"$f":"SUM(M169:N169)","v":0},0,0,0,0]
[2,"Spitale (inclusiv institute cu paturi de spital), din care:",{"$f":"+D170+E170","v":0},0,0,0,0,23,"Centre de diagnostic şi tratament,                 din care:",null,null,{"$f":"+M170+N170","v":0},0,0,0,0]
[3,"      - în camera de gardă şi UPU",{"$f":"+D171+E171","v":0},0,0,0,0,24,"      - în cabinete stomatologice",null,null,{"$f":"SUM(M171:N171)","v":0},0,0,0,0]
[4,"      - în cabinete stomatologice",{"$f":"+D172+E172","v":0},0,0,0,0,25,"Centre medicale de specialitate, din care:",null,null,{"$f":"SUM(M172:N172)","v":0},0,0,0,0]
[5,"Unități sanitare (inclusiv unități asimilate spitalelor) numai cu internare de zi*, din care:",0,0,0,0,0,26,"      - în cabinete stomatologice",null,null,{"$f":"SUM(M173:N173)","v":0},0,0,0,0]
[6,"      - în cabinete stomatologice",0,0,0,0,0,27,"Ambulatorii de  specialitate, din care:",null,null,0,0,0,0,0]
[7,"Centre de sănătate cu paturi de spital, din care:",0,0,0,0,0,28,"      - în cabinete stomatologice",null,null,0,0,0,0,0]
[8,"      - în cabinete stomatologice",0,0,0,0,0,29,"Ambulatorii integrate spitalului, din care:",null,null,0,0,0,0,0]
[9,"Centre de sănătate, din care:",0,0,0,0,0,30,"      - în cabinete stomatologice",null,null,0,0,0,0,0]
[10,"      - în cabinete stomatologice",0,0,0,0,0,31,"Cabinete stomatologice şcolare ",null,null,0,0,0,0,0]
[11,"Centre de sănătate multifuncționale",0,0,0,0,0,32,"Cabinete stomatologice studenţeşti",null,null,0,0,0,0,0]
[12,"Centre de sănătate mintală",0,0,0,0,0,33,"Cabinete stomatologice independente",null,null,0,{"$f":"+'c1'!F15+'c1'!F16","v":0},{"$f":"+'c1'!F18+'c1'!F19","v":0},0,0]
[13,"Sanatorii balneare",0,0,0,0,0,34,"Societăţi stomatologice civile medicale",null,null,0,{"$f":"+'c1'!F30+'c1'!F31","v":0},{"$f":"+'c1'!F33+'c1'!F34","v":0},0,0]
[14,"Dispensare medicale ",0,0,0,0,0,35,"Cabinete medicale independente de specialitate",null,null,0,{"$f":"+'c1'!G15+'c1'!G16","v":0},{"$f":"+'c1'!G18+'c1'!G19","v":0},0,0]
[15,"Cabinete medicale şcolare ",0,0,0,0,0,36,"Societăţi civile medicale de specialitate",null,null,0,{"$f":"+'c1'!G30+'c1'!G31","v":0},{"$f":"+'c1'!G33+'c1'!G34","v":0},0,0]
[16,"Cabinete medicale studenţeşti",0,0,0,0,0,37,"Centre de transfuzie sanguină",null,null,0,0,0,0,0]
[17,"Cabinete independente de medicină generală",0,0,0,0,0,38,"Alte tipuri de cabinete medicale",null,null,{"$f":"SUM(M185:N185)","v":0},0,0,0,0]
[18,"Cabinete independente de medicină de familie",0,{"$f":"+'c1'!E15+'c1'!E16+'c1'!I46+'c1'!J46","v":0},{"$f":"+'c1'!E18+'c1'!E19+'c1'!K46+'c1'!L46","v":0},0,0,39,"Unități rezidențiale pentru persoanele cu dizabilități",null,null,0,0,0,0,0]
[19,"Societăţi medicale civile ",0,{"$f":"+'c1'!E30+'c1'!E31","v":0},{"$f":"+'c1'!E33+'c1'!E34","v":0},0,0,40,"Unități rezidențiale pentru persoanele vârstnice care oferă îngriji medicale în cadrul unității",null,null,0,0,0,0,0]
[20,"Policlinici",0,0,0,0,0,41,"Alte unități de asistență socială care furnizează îngrijiri medicale",null,null,{"$f":"+SUM(M188:O189)","v":0},0,0,0,0]
[21,"Centre de dializă",0,0,0,0,0,42,"Institute și instituții fără paturi *",null,null,{"$f":"+SUM(M189:O190)","v":0},0,0,0,0]
[]
["Cap.10  Dotarea unităţilor sanitare cu echipamente medicale cu tehnologie avansată și utilizarea acestora (examinări medicale)"]
["Nr. Crt.","Tipuri de unităţi sanitare","Aparate (scannere)  pt:",null,"Aparate          Gamma","                                                                      Aparate pt:"]
[null,null,"tomografie computerizată       (aparate TC)","tomografie cu emisie de pozitroni (aparate PET)",null,"rezonanţă magnetică (aparate RMN)","angiografie digitală      (aparate DSA)","mărunţirea calculilor renali –litotriptor   (aparate LSI)","terapie cu radiaţii          (aparate RAD)"," mamografii"]
["A","B","1","2","3","4","5","6","7",8]
["1.    ","ECHIPAMENTE - Total, din care:",{"$f":"SUM(C196:C214)","v":0},0,0,0,0,0,0,0]
["2.    ","Spitale (inclusiv institute cu paturi de spital)",0,0,0,0,0,0,0,0]
["3.    ","Unități sanitare (inclusiv unități asimilate spitalelor) numai cu internare de zi*",0,0,0,0,0,0,0,0]
["4.    ","Centre de sănătate cu paturi de spital",0,0,0,0,0,0,0,0]
["5.    ","Centre de sănătate",0,0,0,0,0,0,0,0]
["6.    ","Dispensare medicale ",0,0,0,0,0,0,0,0]
["7.    ","Cabinete independente de medicină de familie",0,0,0,0,0,0,0,0]
["8.    ","Societăţi medicale civile ",0,0,0,0,0,0,0,0]
["9.    ","Policlinici",0,0,0,0,0,0,0,0]
["10.    ","Centre de dializă și puncte ale centrelor de dializă",0,0,0,0,0,0,0,0]
["11.    ","Centre de diagnostic şi tratament ",0,0,0,0,0,0,0,0]
["12.    ","Centre medicale de specialitate ",0,0,0,0,0,0,0,0]
["13.    ","Ambulatorii de specialitate ",0,0,0,0,0,0,0,0]
["14.    ","Ambulatorii integrate spitalului ",0,0,0,0,0,0,0,0]
["15.    ","Cabinete stomatologice independente",0,0,0,0,0,0,0,0]
["16.    ","Societăţi stomatologice civile medicale ",0,0,0,0,0,0,0,0]
["17.    ","Cabinete medicale independente de specialitate ",0,0,0,0,0,0,0,0]
["18.    ","Societăţi civile medicale de specialitate",0,0,0,0,0,0,0,0]
["19.    ","Alte tipuri de cabinete medicale 1)",0,0,0,0,0,0,0,0]
["20.    ","Laboratoare medicale",0,0,0,0,0,0,0,0]
["21.    ","EXAMINĂRI - Total, din care:",{"$f":"+SUM(C216:C234)","v":0},0,0,0,0,0,0,0]
["22.    ","Spitale (inclusiv institute cu paturi de spital)",0,0,0,0,0,0,0,0]
["23.    ","Unități sanitare (inclusiv unități asimilate spitalelor) numai cu internare de zi*",0,0,0,0,0,0,0,0]
["24.    ","Centre de sănătate cu paturi de spital",0,0,0,0,0,0,0,0]
["25.    ","Centre de sănătate",0,0,0,0,0,0,0,0]
["26.    ","Dispensare medicale ",0,0,0,0,0,0,0,0]
["27.    ","Cabinete independente de medicină de familie",0,0,0,0,0,0,0,0]
["28.    ","Societăţi medicale civile ",0,0,0,0,0,0,0,0]
["29.    ","Policlinici",0,0,0,0,0,0,0,0]
["30.    ","Centre de dializă și puncte ale centrelor de dializă",0,0,0,0,0,0,0,0]
["31.    ","Centre de diagnostic şi tratament ",0,0,0,0,0,0,0,0]
["32.    ","Centre medicale de specialitate ",0,0,0,0,0,0,0,0]
["33.    ","Ambulatorii de specialitate ",0,0,0,0,0,0,0,0]
["34.    ","Ambulatorii integrate spitalului ",0,0,0,0,0,0,0,0]
["35.    ","Cabinete stomatologice independente",0,0,0,0,0,0,0,0]
["36.    ","Societăţi stomatologice civile medicale ",0,0,0,0,0,0,0,0]
["37.    ","Cabinete medicale independente de specialitate ",0,0,0,0,0,0,0,0]
["38.    ","Societăţi civile medicale de specialitate",0,0,0,0,0,0,0,0]
["39.    ","Alte tipuri de cabinete medicale 1)",0,0,0,0,0,0,0,0]
["40.    ","Laboratoare medicale",0,0,0,0,0,0,0,0]
["Cap.6 Nr.personalului existent la sf.anului in unitatile sanitare pe gr.de varsta"]
["Nr. rand","Categorii de personal sanitar",null,null,"Total","din care: femei","Sub 25 ",null,"25-34 ani",null,"35-44 ani",null,"45-54 ani",null,"55-64 ",null,"65 ani şi peste"]
[null,null,null,null,null,null,"Total","d.c: femei","Total","d.c: femei","Total","d.c: femei","Total","d.c: femei","Total","d.c: femei","Total","d.c: femei"]
["A","B",null,null,"1","2","3","4","5","6","7","8","9","10","11","12","13","14"]
[1,"Medici (exclusiv stomatologi)",null,null,{"$f":"G239+I239+K239+M239+O239+Q239","v":0},{"$f":"H239+J239+L239+N239+P239+R239","v":0},{"$f":"+'c15'!G190","v":0},{"$f":"+'c15'!I190","v":0},{"$f":"+'c15'!J190","v":0},{"$f":"+'c15'!L190","v":0},{"$f":"+'c15'!M190","v":0},{"$f":"+'c15'!O190","v":0},{"$f":"+'c15'!P190","v":0},{"$f":"+'c15'!R190","v":0},{"$f":"+'c15'!S190","v":0},{"$f":"+'c15'!U190","v":0},{"$f":"+'c15'!V190","v":0},{"$f":"+'c15'!X190","v":0}]
[2,"din rd.1","medici de familie",null,{"$f":"G240+I240+K240+M240+O240+Q240","v":0},0,{"$f":"+'c15'!G205","v":0},{"$f":"+'c15'!I205","v":0},{"$f":"+'c15'!J205","v":0},{"$f":"+'c15'!L205","v":0},{"$f":"+'c15'!M205","v":0},{"$f":"+'c15'!O205","v":0},{"$f":"+'c15'!P205","v":0},{"$f":"+'c15'!R205","v":0},{"$f":"+'c15'!S205","v":0},{"$f":"+'c15'!U205","v":0},{"$f":"+'c15'!V205","v":0},{"$f":"+'c15'!X205","v":0}]
[3,null,"medici de chirurgie orală și maxilo-facilă",null,0,0,{"$f":"+'c15'!G225","v":0},{"$f":"+'c15'!I225","v":0},{"$f":"+'c15'!J225","v":0},{"$f":"+'c15'!L225","v":0},{"$f":"+'c15'!M225","v":0},{"$f":"+'c15'!O225","v":0},{"$f":"+'c15'!P225","v":0},{"$f":"+'c15'!R225","v":0},{"$f":"+'c15'!S225","v":0},{"$f":"+'c15'!U225","v":0},{"$f":"+'c15'!V225","v":0},{"$f":"+'c15'!X225","v":0}]
[4,null,"medici rezidenţi",null,0,0,{"$f":"+'c15'!G191","v":0},{"$f":"+'c15'!I191","v":0},{"$f":"+'c15'!J191","v":0},{"$f":"+'c15'!L191","v":0},{"$f":"+'c15'!M191","v":0},{"$f":"+'c15'!O191","v":0},{"$f":"+'c15'!P191","v":0},{"$f":"+'c15'!R191","v":0},{"$f":"+'c15'!S191","v":0},{"$f":"+'c15'!U191","v":0},{"$f":"+'c15'!V191","v":0},{"$f":"+'c15'!X191","v":0}]
[5,null,"din rd.4","rezidenţi chirurgie orală și maxilo-facilă",0,0,{"$f":"+'c15'!G226","v":0},{"$f":"+'c15'!I226","v":0},{"$f":"+'c15'!J226","v":0},{"$f":"+'c15'!L226","v":0},{"$f":"+'c15'!M226","v":0},{"$f":"+'c15'!O226","v":0},{"$f":"+'c15'!P226","v":0},{"$f":"+'c15'!R226","v":0},{"$f":"+'c15'!S226","v":0},{"$f":"+'c15'!U226","v":0},{"$f":"+'c15'!V226","v":0},{"$f":"+'c15'!X226","v":0}]
[6,"Medici stomatologi",null,null,0,0,{"$f":"+'c15'!G246","v":0},{"$f":"+'c15'!I246","v":0},{"$f":"+'c15'!J246","v":0},{"$f":"+'c15'!L246","v":0},{"$f":"+'c15'!M246","v":0},{"$f":"+'c15'!O246","v":0},{"$f":"+'c15'!P246","v":0},{"$f":"+'c15'!R246","v":0},{"$f":"+'c15'!S246","v":0},{"$f":"+'c15'!U246","v":0},{"$f":"+'c15'!V246","v":0},{"$f":"+'c15'!X246","v":0}]
[7,"din rd.6","med.stomatologi rezidenţi",null,0,0,{"$f":"+'c15'!G247","v":0},{"$f":"+'c15'!I247","v":0},{"$f":"+'c15'!J247","v":0},{"$f":"+'c15'!L247","v":0},{"$f":"+'c15'!M247","v":0},{"$f":"+'c15'!O247","v":0},{"$f":"+'c15'!P247","v":0},{"$f":"+'c15'!R247","v":0},{"$f":"+'c15'!S247","v":0},{"$f":"+'c15'!U247","v":0},{"$f":"+'c15'!V247","v":0},{"$f":"+'c15'!X247","v":0}]
[8,"Farmacişti",null,null,0,0,{"$f":"+'c15'!G250","v":0},{"$f":"+'c15'!I250","v":0},{"$f":"+'c15'!J250","v":0},{"$f":"+'c15'!L250","v":0},{"$f":"+'c15'!M250","v":0},{"$f":"+'c15'!O250","v":0},{"$f":"+'c15'!P250","v":0},{"$f":"+'c15'!R250","v":0},{"$f":"+'c15'!S250","v":0},{"$f":"+'c15'!U250","v":0},{"$f":"+'c15'!V250","v":0},{"$f":"+'c15'!X250","v":0}]
[9,"din rd.8","farmacişti rezidenţi",null,0,0,{"$f":"+'c15'!G251","v":0},{"$f":"+'c15'!I251","v":0},{"$f":"+'c15'!J251","v":0},{"$f":"+'c15'!L251","v":0},{"$f":"+'c15'!M251","v":0},{"$f":"+'c15'!O251","v":0},{"$f":"+'c15'!P251","v":0},{"$f":"+'c15'!R251","v":0},{"$f":"+'c15'!S251","v":0},{"$f":"+'c15'!U251","v":0},{"$f":"+'c15'!V251","v":0},{"$f":"+'c15'!X251","v":0}]
[10,"Fiziokinetoterapeuţi cu studii superioare",null,null,{"$f":"G248+I248+K248+M248+O248+Q248","v":0},{"$f":"H248+J248+L248+N248+P248+R248","v":0},{"$f":"+'c15'!G254","v":0},{"$f":"+'c15'!I254","v":0},{"$f":"+'c15'!J254","v":0},{"$f":"+'c15'!L254","v":0},{"$f":"+'c15'!M254","v":0},{"$f":"+'c15'!O254","v":0},{"$f":"+'c15'!P254","v":0},{"$f":"+'c15'!R254","v":0},{"$f":"+'c15'!S254","v":0},{"$f":"+'c15'!U254","v":0},{"$f":"+'c15'!V254","v":0},{"$f":"+'c15'!X254","v":0}]
[11,"din rd.10","fizioterapeuti",null,0,0,{"$f":"+'c15'!G255","v":0},{"$f":"+'c15'!I255","v":0},{"$f":"+'c15'!J255","v":0},{"$f":"+'c15'!L255","v":0},{"$f":"+'c15'!M255","v":0},{"$f":"+'c15'!O255","v":0},{"$f":"+'c15'!P255","v":0},{"$f":"+'c15'!R255","v":0},{"$f":"+'c15'!S255","v":0},{"$f":"+'c15'!U255","v":0},{"$f":"+'c15'!V255","v":0},{"$f":"+'c15'!X255","v":0}]
[12,"Asistenti medicali cu studii superioare",null,null,0,0,{"$f":"+'c15'!G256","v":0},{"$f":"+'c15'!I256","v":0},{"$f":"+'c15'!J256","v":0},{"$f":"+'c15'!L256","v":0},{"$f":"+'c15'!M256","v":0},{"$f":"+'c15'!O256","v":0},{"$f":"+'c15'!P256","v":0},{"$f":"+'c15'!R256","v":0},{"$f":"+'c15'!S256","v":0},{"$f":"+'c15'!U256","v":0},{"$f":"+'c15'!V256","v":0},{"$f":"+'c15'!X256","v":0}]
[13,"din rd.12","Moașe",null,0,0,{"$f":"+'c15'!G257","v":0},{"$f":"+'c15'!I257","v":0},{"$f":"+'c15'!J257","v":0},{"$f":"+'c15'!L257","v":0},{"$f":"+'c15'!M257","v":0},{"$f":"+'c15'!O257","v":0},{"$f":"+'c15'!P257","v":0},{"$f":"+'c15'!R257","v":0},{"$f":"+'c15'!S257","v":0},{"$f":"+'c15'!U257","v":0},{"$f":"+'c15'!V257","v":0},{"$f":"+'c15'!X257","v":0}]
[14,"Alt personal sanitar cu  studii superioare ",null,null,0,0,{"$f":"+'c15'!G258","v":0},{"$f":"+'c15'!I258","v":0},{"$f":"+'c15'!J258","v":0},{"$f":"+'c15'!L258","v":0},{"$f":"+'c15'!M258","v":0},{"$f":"+'c15'!O258","v":0},{"$f":"+'c15'!P258","v":0},{"$f":"+'c15'!R258","v":0},{"$f":"+'c15'!S258","v":0},{"$f":"+'c15'!U258","v":0},{"$f":"+'c15'!V258","v":0},{"$f":"+'c15'!X258","v":0}]
[15,"Alt personal cu  studii superioare ",null,null,0,0,{"$f":"+'c15'!G259","v":0},{"$f":"+'c15'!I259","v":0},{"$f":"+'c15'!J259","v":0},{"$f":"+'c15'!L259","v":0},{"$f":"+'c15'!M259","v":0},{"$f":"+'c15'!O259","v":0},{"$f":"+'c15'!P259","v":0},{"$f":"+'c15'!R259","v":0},{"$f":"+'c15'!S259","v":0},{"$f":"+'c15'!U259","v":0},{"$f":"+'c15'!V259","v":0},{"$f":"+'c15'!X259","v":0}]
[16,"Personal sanitar mediu",null,null,0,0,{"$f":"+'c15'!G62","v":0},{"$f":"+'c15'!I62","v":0},{"$f":"+'c15'!J62","v":0},{"$f":"+'c15'!L62","v":0},{"$f":"+'c15'!M62","v":0},{"$f":"+'c15'!O62","v":0},{"$f":"+'c15'!P62","v":0},{"$f":"+'c15'!R62","v":0},{"$f":"+'c15'!S62","v":0},{"$f":"+'c15'!U62","v":0},{"$f":"+'c15'!V62","v":0},{"$f":"+'c15'!X62","v":0}]
[17,"din rd.16","total as.medicali",null,0,0,{"$f":"+'c15'!G63","v":0},{"$f":"+'c15'!I63","v":0},{"$f":"+'c15'!J63","v":0},{"$f":"+'c15'!L63","v":0},{"$f":"+'c15'!M63","v":0},{"$f":"+'c15'!O63","v":0},{"$f":"+'c15'!P63","v":0},{"$f":"+'c15'!R63","v":0},{"$f":"+'c15'!S63","v":0},{"$f":"+'c15'!U63","v":0},{"$f":"+'c15'!V63","v":0},{"$f":"+'c15'!X63","v":0}]
[18,"din rd.17","asistenţi obstetrică-ginecologie (moașe)",null,0,0,{"$f":"+'c15'!G66","v":0},{"$f":"+'c15'!I66","v":0},{"$f":"+'c15'!J66","v":0},{"$f":"+'c15'!L66","v":0},{"$f":"+'c15'!M66","v":0},{"$f":"+'c15'!O66","v":0},{"$f":"+'c15'!P66","v":0},{"$f":"+'c15'!R66","v":0},{"$f":"+'c15'!S66","v":0},{"$f":"+'c15'!U66","v":0},{"$f":"+'c15'!V66","v":0},{"$f":"+'c15'!X66","v":0}]
[19,null,"as.fiziokinetoterapeuţi",null,{"$f":"G257+I257+K257+M257+O257+Q257","v":0},0,{"$f":"+'c15'!G74","v":0},{"$f":"+'c15'!I74","v":0},{"$f":"+'c15'!J74","v":0},{"$f":"+'c15'!L74","v":0},{"$f":"+'c15'!M74","v":0},{"$f":"+'c15'!O74","v":0},{"$f":"+'c15'!P74","v":0},{"$f":"+'c15'!R74","v":0},{"$f":"+'c15'!S74","v":0},{"$f":"+'c15'!U74","v":0},{"$f":"+'c15'!V74","v":0},{"$f":"+'c15'!X74","v":0}]
[20,null,"din rd.19","as. fizioterapeuţi",0,0,{"$f":"+'c15'!G75","v":0},{"$f":"+'c15'!I75","v":0},{"$f":"+'c15'!J75","v":0},{"$f":"+'c15'!L75","v":0},{"$f":"+'c15'!M75","v":0},{"$f":"+'c15'!O75","v":0},{"$f":"+'c15'!P75","v":0},{"$f":"+'c15'!R75","v":0},{"$f":"+'c15'!S75","v":0},{"$f":"+'c15'!U75","v":0},{"$f":"+'c15'!V75","v":0},{"$f":"+'c15'!X75","v":0}]
[21,"Personal sanitar auxiliar",null,null,0,0,{"$f":"+'c15'!G94","v":0},{"$f":"+'c15'!I94","v":0},{"$f":"+'c15'!J94","v":0},{"$f":"+'c15'!L94","v":0},{"$f":"+'c15'!M94","v":0},{"$f":"+'c15'!O94","v":0},{"$f":"+'c15'!P94","v":0},{"$f":"+'c15'!R94","v":0},{"$f":"+'c15'!S94","v":0},{"$f":"+'c15'!U94","v":0},{"$f":"+'c15'!V94","v":0},{"$f":"+'c15'!X94","v":0}]
[22,"Alt personal mediu angajat",null,null,0,0,{"$f":"+'c15'!G95+'c15'!G96+'c15'!G97","v":0},{"$f":"+'c15'!I95+'c15'!I96+'c15'!I97","v":0},{"$f":"+'c15'!J95+'c15'!J96+'c15'!J97","v":0},{"$f":"+'c15'!L95+'c15'!L96+'c15'!L97","v":0},{"$f":"+'c15'!M95+'c15'!M96+'c15'!M97","v":0},{"$f":"+'c15'!O95+'c15'!O96+'c15'!O97","v":0},{"$f":"+'c15'!P95+'c15'!P96+'c15'!P97","v":0},{"$f":"+'c15'!R95+'c15'!R96+'c15'!R97","v":0},{"$f":"+'c15'!S95+'c15'!S96+'c15'!S97","v":0},{"$f":"+'c15'!U95+'c15'!U96+'c15'!U97","v":0},{"$f":"+'c15'!V95+'c15'!V96+'c15'!V97","v":0},{"$f":"+'c15'!X95+'c15'!X96+'c15'!X97","v":0}]
["Cap.7  Numărul personalului cu studii superioare, existent la sfârşitul anului, pe tipuri de unităţi sanitare"]
[null,null,{"$f":"IF(C266=E239,\"OK\",\"Err\")","v":"OK"},{"$f":"IF(D266=F239,\"OK\",\"Err\")","v":"OK"},{"$f":"IF(E266=E244,\"OK\",\"Err\")","v":"OK"},{"$f":"IF(F266=F244,\"OK\",\"Err\")","v":"OK"},{"$f":"IF(G266=E246,\"OK\",\"Err\")","v":"OK"},{"$f":"IF(H266=F246,\"OK\",\"Err\")","v":"OK"},{"$f":"IF(I266=E248,\"OK\",\"Err\")","v":"OK"},{"$f":"IF(J266=F248,\"OK\",\"Err\")","v":"OK"},{"$f":"IF(K266=E249,\"OK\",\"Err\")","v":"OK"},{"$f":"IF(L266=F249,\"OK\",\"Err\")","v":"OK"},{"$f":"IF(M266=E250,\"OK\",\"Err\")","v":"OK"},{"$f":"IF(N266=F250,\"OK\",\"Err\")","v":"OK"},{"$f":"IF(O266=E251,\"OK\",\"Err\")","v":"OK"},{"$f":"IF(P266=F251,\"OK\",\"Err\")","v":"OK"},{"$f":"IF(Q266=E252,\"OK\",\"Err\")","v":"OK"},{"$f":"IF(R266=F252,\"OK\",\"Err\")","v":"OK"},{"$f":"IF(S266=E253,\"OK\",\"Err\")","v":"OK"},{"$f":"IF(T266=F253,\"OK\",\"Err\")","v":"OK"}]
["Nr. Crt.","Tipuri de unităţi sanitare","Medici (exclusiv stomatologi)",null,"Medici stomatologi",null,"Farmacişti",null,"Fiziokinetoterapeuţi",null,"din care: Fizioterapeuţi",null,"As.med. (cu std.sup.)",null," din care: moaşe",null,"Alt personal sanitar        (cu stud.super)",null,"Alt personal cu studii superioare"]
[null,null,"Total ","d.c: femei","Total ","d.c: femei","Total ","d.c: femei","Total ","d.c: femei","Total ","d.c: femei","Total ","d.c: femei","Total ","d.c: femei","Total ","d.c: femei","Total ","d.c: femei"]
["A","B","1","2","3","4","5","6","7","8","9","10","11","12","13","14",15,16,17,18]
[1,"Total, personal cu studii superioare",{"$f":"SUM(C268:C321)-C269-C271-C273-C276-C279-C281-C283-C285-C287-C300","v":0},{"$f":"SUM(D268:D321)-D269-D271-D273-D276-D279-D281-D283-D285-D287-D300","v":0},0,0,0,0,0,0,0,0,0,0,0,0,0,0,0,0]
[2," - din care: cu normă întreagă",{"$f":"+'c15'!Y190","v":0},{"$f":"+'c15'!AA190","v":0},{"$f":"+'c15'!Y246","v":0},{"$f":"+'c15'!AA246","v":0},{"$f":"+'c15'!Y250","v":0},{"$f":"+'c15'!AA250","v":0},{"$f":"+'c15'!Y254","v":0},{"$f":"+'c15'!AA254","v":0},{"$f":"+'c15'!Y255","v":0},{"$f":"+'c15'!AA255","v":0},{"$f":"+'c15'!Y256","v":0},{"$f":"+'c15'!AA256","v":0},{"$f":"+'c15'!Y257","v":0},{"$f":"+'c15'!AA257","v":0},{"$f":"+'c15'!Y258","v":0},{"$f":"+'c15'!AA258","v":0},{"$f":"+'c15'!Y259","v":0},{"$f":"+'c15'!AA259","v":0}]
[3,"Spitale (inclusiv institute cu paturi de spital)",{"$f":"+'c15'!P109","v":0},{"$f":"+'c15'!R109","v":0},{"$f":"+'c15'!P164","v":0},{"$f":"+'c15'!R164","v":0},{"$f":"+'c15'!P168","v":0},{"$f":"+'c15'!R168","v":0},{"$f":"+'c15'!P172","v":0},{"$f":"+'c15'!R172","v":0},{"$f":"+'c15'!P173","v":0},{"$f":"+'c15'!R173","v":0},{"$f":"+'c15'!P174","v":0},{"$f":"+'c15'!R174","v":0},{"$f":"+'c15'!P175","v":0},{"$f":"+'c15'!R175","v":0},{"$f":"+'c15'!P176","v":0},{"$f":"+'c15'!R176","v":0},{"$f":"+'c15'!P177","v":0},{"$f":"+'c15'!R177","v":0}]
[4," - din care: cu normă întreagă",{"$f":"+'c15'!$AB$190","v":0},{"$f":"+'c15'!$AD$190","v":0},{"$f":"+'c15'!$AB$246","v":0},{"$f":"+'c15'!$AD$246","v":0},{"$f":"+'c15'!$AB$250","v":0},{"$f":"+'c15'!$AD$250","v":0},{"$f":"+'c15'!$AB$254","v":0},{"$f":"+'c15'!$AD$254","v":0},{"$f":"+'c15'!$AB$255","v":0},{"$f":"+'c15'!$AD$255","v":0},{"$f":"+'c15'!$AB$256","v":0},{"$f":"+'c15'!$AD$256","v":0},{"$f":"+'c15'!$AB$257","v":0},{"$f":"+'c15'!$AD$257","v":0},{"$f":"+'c15'!$AB$258","v":0},{"$f":"+'c15'!$AD$258","v":0},{"$f":"+'c15'!$AB$259","v":0},{"$f":"+'c15'!$AD$259","v":0}]
[5,"Unități sanitare (inclusiv unități asimilate spitalelor) numai cu internare de zi*",0,0,0,0,0,0,0,0,0,0,0,0,0,0,0,0,0,0]
[6," - din care: cu normă întreagă",0,0,0,0,0,0,0,0,0,0,0,0,0,0,0,0,0,0]
[7,"Centre de sanatate cu paturi de spital",0,0,0,0,0,0,0,0,0,0,0,0,0,0,0,0,0,0]
[8," - din care: cu normă întreagă",0,0,0,0,0,0,0,0,0,0,0,0,0,0,0,0,0,0]
[9,"Centre de sănătate",{"$f":"+'c15'!CG109","v":0},{"$f":"+'c15'!CI109","v":0},{"$f":"+'c15'!CG164","v":0},{"$f":"+'c15'!CI164","v":0},{"$f":"+'c15'!CG168","v":0},{"$f":"+'c15'!CI168","v":0},{"$f":"+'c15'!CG172","v":0},{"$f":"+'c15'!CI172","v":0},{"$f":"+'c15'!CG173","v":0},{"$f":"+'c15'!CI173","v":0},{"$f":"+'c15'!CG174","v":0},{"$f":"+'c15'!CI174","v":0},{"$f":"+'c15'!CG175","v":0},{"$f":"+'c15'!CI175","v":0},{"$f":"+'c15'!CG176","v":0},{"$f":"+'c15'!CI176","v":0},{"$f":"+'c15'!CG177","v":0},{"$f":"+'c15'!CI177","v":0}]
[10,"Centre de sănătate multifuncționale",0,0,0,0,0,0,0,0,0,0,0,0,0,0,0,0,0,0]
[11," - din care: cu normă întreagă",0,0,0,0,0,0,0,0,0,0,0,0,0,0,0,0,0,0]
[12,"Centre de sănătate mintală",0,0,0,0,0,0,0,0,0,0,0,0,0,0,0,0,0,0]
[13,"Unităţi medico-sociale",0,0,0,0,0,0,0,0,0,0,0,0,0,0,0,0,0,0]
[14," - din care: cu normă întreagă",0,0,0,0,0,0,0,0,0,0,0,0,0,0,0,0,0,0]
[15,"Sanatorii TBC",{"$f":"+'c15'!V109","v":0},{"$f":"+'c15'!X109","v":0},{"$f":"+'c15'!V164","v":0},{"$f":"+'c15'!X164","v":0},{"$f":"+'c15'!V168","v":0},{"$f":"+'c15'!X168","v":0},{"$f":"+'c15'!V172","v":0},{"$f":"+'c15'!X172","v":0},{"$f":"+'c15'!V173","v":0},{"$f":"+'c15'!X173","v":0},{"$f":"+'c15'!V174","v":0},{"$f":"+'c15'!X174","v":0},{"$f":"+'c15'!V175","v":0},{"$f":"+'c15'!X175","v":0},{"$f":"+'c15'!V176","v":0},{"$f":"+'c15'!X176","v":0},{"$f":"+'c15'!V177","v":0},{"$f":"+'c15'!X177","v":0}]
[16," - din care: cu normă întreagă",0,0,0,0,0,0,0,0,0,0,0,0,0,0,0,0,0,0]
[17,"Preventorii",{"$f":"+'c15'!Y109","v":0},{"$f":"+'c15'!AA109","v":0},{"$f":"+'c15'!Y164","v":0},{"$f":"+'c15'!AA164","v":0},{"$f":"+'c15'!Y168","v":0},{"$f":"+'c15'!AA168","v":0},{"$f":"+'c15'!Y172","v":0},{"$f":"+'c15'!AA172","v":0},{"$f":"+'c15'!Y173","v":0},{"$f":"+'c15'!AA173","v":0},{"$f":"+'c15'!Y174","v":0},{"$f":"+'c15'!AA174","v":0},{"$f":"+'c15'!Y175","v":0},{"$f":"+'c15'!AA175","v":0},{"$f":"+'c15'!Y176","v":0},{"$f":"+'c15'!AA176","v":0},{"$f":"+'c15'!Y177","v":0},{"$f":"+'c15'!AA177","v":0}]
[18," - din care: cu normă întreagă",0,0,0,0,0,0,0,0,0,0,0,0,0,0,0,0,0,0]
[19,"Sanatorii de nevroze sau de neuropsihiatrie",{"$f":"+'c15'!DB109","v":0},{"$f":"+'c15'!DD109","v":0},{"$f":"+'c15'!DB164","v":0},{"$f":"+'c15'!DD164","v":0},{"$f":"+'c15'!DB168","v":0},{"$f":"+'c15'!DD168","v":0},{"$f":"+'c15'!DB172","v":0},{"$f":"+'c15'!DD172","v":0},{"$f":"+'c15'!DB173","v":0},{"$f":"+'c15'!DD173","v":0},{"$f":"+'c15'!DB174","v":0},{"$f":"+'c15'!DD174","v":0},{"$f":"+'c15'!DB175","v":0},{"$f":"+'c15'!DD175","v":0},{"$f":"+'c15'!DB176","v":0},{"$f":"+'c15'!DD176","v":0},{"$f":"+'c15'!DB177","v":0},{"$f":"+'c15'!DD177","v":0}]
[20," - din care: cu normă întreagă",0,0,0,0,0,0,0,0,0,0,0,0,0,0,0,0,0,0]
[21,"Sanatorii balneare ",{"$f":"+'c15'!AB109","v":0},{"$f":"+'c15'!AD109","v":0},{"$f":"+'c15'!AB164","v":0},{"$f":"+'c15'!AD164","v":0},{"$f":"+'c15'!AB168","v":0},{"$f":"+'c15'!AD168","v":0},{"$f":"+'c15'!AB172","v":0},{"$f":"+'c15'!AD172","v":0},{"$f":"+'c15'!AB173","v":0},{"$f":"+'c15'!AD173","v":0},{"$f":"+'c15'!AB174","v":0},{"$f":"+'c15'!AD174","v":0},{"$f":"+'c15'!AB175","v":0},{"$f":"+'c15'!AD175","v":0},{"$f":"+'c15'!AB176","v":0},{"$f":"+'c15'!AD176","v":0},{"$f":"+'c15'!AB177","v":0},{"$f":"+'c15'!AD177","v":0}]
[22," - din care: cu normă întreagă",0,0,0,0,0,0,0,0,0,0,0,0,0,0,0,0,0,0]
[23,"Dispensare medicale ",{"$f":"+'c15'!AE109","v":0},{"$f":"+'c15'!AG109","v":0},{"$f":"+'c15'!AE164","v":0},{"$f":"+'c15'!AG164","v":0},{"$f":"+'c15'!AE168","v":0},{"$f":"+'c15'!AG168","v":0},{"$f":"+'c15'!AE172","v":0},{"$f":"+'c15'!AG172","v":0},{"$f":"+'c15'!AE173","v":0},{"$f":"+'c15'!AG173","v":0},{"$f":"+'c15'!AE174","v":0},{"$f":"+'c15'!AG174","v":0},{"$f":"+'c15'!AE175","v":0},{"$f":"+'c15'!AG175","v":0},{"$f":"+'c15'!AE176","v":0},{"$f":"+'c15'!AG176","v":0},{"$f":"+'c15'!AE177","v":0},{"$f":"+'c15'!AG177","v":0}]
[24,"Cabinete medicale şcolare ",{"$f":"+'c15'!AH109","v":0},{"$f":"+'c15'!AJ109","v":0},{"$f":"+'c15'!AH164","v":0},{"$f":"+'c15'!AJ164","v":0},{"$f":"+'c15'!AH168","v":0},{"$f":"+'c15'!AJ168","v":0},{"$f":"+'c15'!AH172","v":0},{"$f":"+'c15'!AJ172","v":0},{"$f":"+'c15'!AH173","v":0},{"$f":"+'c15'!AJ173","v":0},{"$f":"+'c15'!AH174","v":0},{"$f":"+'c15'!AJ174","v":0},{"$f":"+'c15'!AH175","v":0},{"$f":"+'c15'!AJ175","v":0},{"$f":"+'c15'!AH176","v":0},{"$f":"+'c15'!AJ176","v":0},{"$f":"+'c15'!AH177","v":0},{"$f":"+'c15'!AJ177","v":0}]
[25,"Cabinete medicale studenţeşti",{"$f":"+'c15'!AK109","v":0},{"$f":"+'c15'!AM109","v":0},{"$f":"+'c15'!AK164","v":0},{"$f":"+'c15'!AM164","v":0},{"$f":"+'c15'!AK168","v":0},{"$f":"+'c15'!AM168","v":0},{"$f":"+'c15'!AK172","v":0},{"$f":"+'c15'!AM172","v":0},{"$f":"+'c15'!AK173","v":0},{"$f":"+'c15'!AM173","v":0},{"$f":"+'c15'!AK174","v":0},{"$f":"+'c15'!AM174","v":0},{"$f":"+'c15'!AK175","v":0},{"$f":"+'c15'!AM175","v":0},{"$f":"+'c15'!AK176","v":0},{"$f":"+'c15'!AM176","v":0},{"$f":"+'c15'!AK177","v":0},{"$f":"+'c15'!AM177","v":0}]
[26,"Cabinete independente de medicină generală",{"$f":"'c15'!AN109","v":0},{"$f":"'c15'!AP109","v":0},{"$f":"'c15'!AN164","v":0},{"$f":"'c15'!AP164","v":0},{"$f":"'c15'!AN168","v":0},{"$f":"'c15'!AP168","v":0},{"$f":"'c15'!AN172","v":0},{"$f":"'c15'!AP172","v":0},{"$f":"'c15'!AN173","v":0},{"$f":"'c15'!AP173","v":0},{"$f":"'c15'!AN174","v":0},{"$f":"'c15'!AP174","v":0},{"$f":"'c15'!AN175","v":0},{"$f":"'c15'!AP175","v":0},{"$f":"'c15'!AN176","v":0},{"$f":"'c15'!AP176","v":0},{"$f":"'c15'!AN177","v":0},{"$f":"'c15'!AP177","v":0}]
[27,"Cabinete independente de medicină de familie ",{"$f":"+'c15'!AQ109","v":0},{"$f":"+'c15'!AS109","v":0},{"$f":"+'c15'!AQ164","v":0},{"$f":"+'c15'!AS164","v":0},{"$f":"+'c15'!AQ168","v":0},{"$f":"+'c15'!AS168","v":0},{"$f":"+'c15'!AQ172","v":0},{"$f":"+'c15'!AS172","v":0},{"$f":"+'c15'!AQ173","v":0},{"$f":"+'c15'!AS173","v":0},{"$f":"+'c15'!AQ174","v":0},{"$f":"+'c15'!AS174","v":0},{"$f":"+'c15'!AQ175","v":0},{"$f":"+'c15'!AS175","v":0},{"$f":"+'c15'!AQ176","v":0},{"$f":"+'c15'!AS176","v":0},{"$f":"+'c15'!AQ177","v":0},{"$f":"+'c15'!AS177","v":0},{"$f":"IF(E240>=C292,\"OK\",\"Err\")","v":"OK"},{"$f":"IF(F240>=D292,\"OK\",\"Err\")","v":"OK"}]
[28,"Societăţi medicale civile ",{"$f":"+'c15'!AT109","v":0},{"$f":"+'c15'!AV109","v":0},{"$f":"+'c15'!AT164","v":0},{"$f":"+'c15'!AV164","v":0},{"$f":"+'c15'!AT168","v":0},{"$f":"+'c15'!AV168","v":0},{"$f":"+'c15'!AT172","v":0},{"$f":"+'c15'!AV172","v":0},{"$f":"+'c15'!AT173","v":0},{"$f":"+'c15'!AV173","v":0},{"$f":"+'c15'!AT174","v":0},{"$f":"+'c15'!AV174","v":0},{"$f":"+'c15'!AT175","v":0},{"$f":"+'c15'!AV175","v":0},{"$f":"+'c15'!AT176","v":0},{"$f":"+'c15'!AV176","v":0},{"$f":"+'c15'!AT177","v":0},{"$f":"+'c15'!AV177","v":0}]
[29,"Farmacii",{"$f":"+'c15'!AW109","v":0},{"$f":"+'c15'!AY109","v":0},{"$f":"+'c15'!AW164","v":0},{"$f":"+'c15'!AY164","v":0},{"$f":"+'c15'!AW168","v":0},{"$f":"+'c15'!AY168","v":0},{"$f":"+'c15'!AW172","v":0},{"$f":"+'c15'!AY172","v":0},{"$f":"+'c15'!AW173","v":0},{"$f":"+'c15'!AY173","v":0},{"$f":"+'c15'!AW174","v":0},{"$f":"+'c15'!AY174","v":0},{"$f":"+'c15'!AW175","v":0},{"$f":"+'c15'!AY175","v":0},{"$f":"+'c15'!AW176","v":0},{"$f":"+'c15'!AY176","v":0},{"$f":"+'c15'!AW177","v":0},{"$f":"+'c15'!AY177","v":0}]
[30,"Puncte de lucru ale farmaciilor",{"$f":"+'c15'!AZ109","v":0},{"$f":"+'c15'!BB109","v":0},{"$f":"+'c15'!AZ164","v":0},{"$f":"+'c15'!BB164","v":0},{"$f":"+'c15'!AZ168","v":0},{"$f":"+'c15'!BB168","v":0},{"$f":"+'c15'!AZ172","v":0},{"$f":"+'c15'!BB172","v":0},{"$f":"+'c15'!AZ173","v":0},{"$f":"+'c15'!BB173","v":0},{"$f":"+'c15'!AZ174","v":0},{"$f":"+'c15'!BB174","v":0},{"$f":"+'c15'!AZ175","v":0},{"$f":"+'c15'!BB175","v":0},{"$f":"+'c15'!AZ176","v":0},{"$f":"+'c15'!BB176","v":0},{"$f":"+'c15'!AZ177","v":0},{"$f":"+'c15'!BB177","v":0}]
[31,"Drogherii",0,0,0,0,0,0,0,0,0,0,0,0,0,0,0,0,0,0]
[32,"Depozite farmaceutice",{"$f":"+'c15'!BC109","v":0},{"$f":"+'c15'!BE109","v":0},{"$f":"+'c15'!BC164","v":0},{"$f":"+'c15'!BE164","v":0},{"$f":"+'c15'!BC168","v":0},{"$f":"+'c15'!BE168","v":0},{"$f":"+'c15'!BC172","v":0},{"$f":"+'c15'!BE172","v":0},{"$f":"+'c15'!BC173","v":0},{"$f":"+'c15'!BE173","v":0},{"$f":"+'c15'!BC174","v":0},{"$f":"+'c15'!BE174","v":0},{"$f":"+'c15'!BC175","v":0},{"$f":"+'c15'!BE175","v":0},{"$f":"+'c15'!BC176","v":0},{"$f":"+'c15'!BE176","v":0},{"$f":"+'c15'!BC177","v":0},{"$f":"+'c15'!BE177","v":0}]
[33,"Policlinici",{"$f":"+'c15'!BF109","v":0},{"$f":"+'c15'!BH109","v":0},{"$f":"+'c15'!BF164","v":0},{"$f":"+'c15'!BH164","v":0},{"$f":"+'c15'!BF168","v":0},{"$f":"+'c15'!BH168","v":0},{"$f":"+'c15'!BF172","v":0},{"$f":"+'c15'!BH172","v":0},{"$f":"+'c15'!BF173","v":0},{"$f":"+'c15'!BH173","v":0},{"$f":"+'c15'!BF174","v":0},{"$f":"+'c15'!BH174","v":0},{"$f":"+'c15'!BF175","v":0},{"$f":"+'c15'!BH175","v":0},{"$f":"+'c15'!BF176","v":0},{"$f":"+'c15'!BH176","v":0},{"$f":"+'c15'!BF177","v":0},{"$f":"+'c15'!BH177","v":0}]
[34,"Centre de dializă și puncte ale centrelor de dializă",0,0,0,0,0,0,0,0,0,0,0,0,0,0,0,0,0,0]
[35," - din care: cu normă întreagă",0,0,0,0,0,0,0,0,0,0,0,0,0,0,0,0,0,0]
[36,"Centre de diagnostic şi tratament ",{"$f":"+'c15'!BI109","v":0},{"$f":"+'c15'!BK109","v":0},{"$f":"+'c15'!BI164","v":0},{"$f":"+'c15'!BK164","v":0},{"$f":"+'c15'!BI168","v":0},{"$f":"+'c15'!BK168","v":0},{"$f":"+'c15'!BI172","v":0},{"$f":"+'c15'!BK172","v":0},{"$f":"+'c15'!BI173","v":0},{"$f":"+'c15'!BK173","v":0},{"$f":"+'c15'!BI174","v":0},{"$f":"+'c15'!BK174","v":0},{"$f":"+'c15'!BI175","v":0},{"$f":"+'c15'!BK175","v":0},{"$f":"+'c15'!BI176","v":0},{"$f":"+'c15'!BK176","v":0},{"$f":"+'c15'!BI177","v":0},{"$f":"+'c15'!BK177","v":0}]
[37,"Centre medicale de specialitate",{"$f":"+'c15'!BL109","v":0},{"$f":"+'c15'!BN109","v":0},{"$f":"+'c15'!BL164","v":0},{"$f":"+'c15'!BN164","v":0},{"$f":"+'c15'!BL168","v":0},{"$f":"+'c15'!BN168","v":0},{"$f":"+'c15'!BL172","v":0},{"$f":"+'c15'!BN172","v":0},{"$f":"+'c15'!BL173","v":0},{"$f":"+'c15'!BN173","v":0},{"$f":"+'c15'!BL174","v":0},{"$f":"+'c15'!BN174","v":0},{"$f":"+'c15'!BL175","v":0},{"$f":"+'c15'!BN175","v":0},{"$f":"+'c15'!BL176","v":0},{"$f":"+'c15'!BN176","v":0},{"$f":"+'c15'!BL177","v":0},{"$f":"+'c15'!BN177","v":0}]
[38,"Ambulatorii de specialitate ",{"$f":"+'c15'!BO109","v":0},{"$f":"+'c15'!BQ109","v":0},{"$f":"+'c15'!BO164","v":0},{"$f":"+'c15'!BQ164","v":0},{"$f":"+'c15'!BO168","v":0},{"$f":"+'c15'!BQ168","v":0},{"$f":"+'c15'!BO172","v":0},{"$f":"+'c15'!BQ172","v":0},{"$f":"+'c15'!BO173","v":0},{"$f":"+'c15'!BQ173","v":0},{"$f":"+'c15'!BO174","v":0},{"$f":"+'c15'!BQ174","v":0},{"$f":"+'c15'!BO175","v":0},{"$f":"+'c15'!BQ175","v":0},{"$f":"+'c15'!BO176","v":0},{"$f":"+'c15'!BQ176","v":0},{"$f":"+'c15'!BO177","v":0},{"$f":"+'c15'!BQ177","v":0}]
[39,"Ambulatorii integrate spitalului ",{"$f":"+'c15'!BR109","v":0},{"$f":"+'c15'!BT109","v":0},{"$f":"+'c15'!BR164","v":0},{"$f":"+'c15'!BT164","v":0},{"$f":"+'c15'!BR168","v":0},{"$f":"+'c15'!BT168","v":0},{"$f":"+'c15'!BR172","v":0},{"$f":"+'c15'!BT172","v":0},{"$f":"+'c15'!BR173","v":0},{"$f":"+'c15'!BT173","v":0},{"$f":"+'c15'!BR174","v":0},{"$f":"+'c15'!BT174","v":0},{"$f":"+'c15'!BR175","v":0},{"$f":"+'c15'!BT175","v":0},{"$f":"+'c15'!BR176","v":0},{"$f":"+'c15'!BT176","v":0},{"$f":"+'c15'!BR177","v":0},{"$f":"+'c15'!BT177","v":0}]
[40,"Cabinete stomatologice şcolare ",0,0,0,0,0,0,0,0,0,0,0,0,0,0,0,0,0,0]
[41,"Cabinete stomatologice studenţeşti",0,0,0,0,0,0,0,0,0,0,0,0,0,0,0,0,0,0]
[42,"Cabinete stomatologice independente",{"$f":"+'c15'!BU109","v":0},{"$f":"+'c15'!BW109","v":0},{"$f":"+'c15'!BU164","v":0},{"$f":"+'c15'!BW164","v":0},{"$f":"+'c15'!BU168","v":0},{"$f":"+'c15'!BW168","v":0},{"$f":"+'c15'!BU172","v":0},{"$f":"+'c15'!BW172","v":0},{"$f":"+'c15'!BU173","v":0},{"$f":"+'c15'!BW173","v":0},{"$f":"+'c15'!BU174","v":0},{"$f":"+'c15'!BW174","v":0},{"$f":"+'c15'!BU175","v":0},{"$f":"+'c15'!BW175","v":0},{"$f":"+'c15'!BU176","v":0},{"$f":"+'c15'!BW176","v":0},{"$f":"+'c15'!BU177","v":0},{"$f":"+'c15'!BW177","v":0}]
[43,"Societăţi stomatologice civile medicale ",{"$f":"+'c15'!BX109","v":0},{"$f":"+'c15'!BZ109","v":0},{"$f":"+'c15'!BZ164","v":0},{"$f":"+'c15'!BY164","v":0},{"$f":"+'c15'!BX168","v":0},{"$f":"+'c15'!BZ168","v":0},{"$f":"+'c15'!BX172","v":0},{"$f":"+'c15'!BZ172","v":0},{"$f":"+'c15'!BX173","v":0},{"$f":"+'c15'!BZ173","v":0},{"$f":"+'c15'!BX174","v":0},{"$f":"+'c15'!BZ174","v":0},{"$f":"+'c15'!BX175","v":0},{"$f":"+'c15'!BZ175","v":0},{"$f":"+'c15'!BX176","v":0},{"$f":"+'c15'!BZ176","v":0},{"$f":"+'c15'!BX177","v":0},{"$f":"+'c15'!BZ177","v":0}]
[44,"Cabinete medicale independente de specialitate ",{"$f":"+'c15'!CA109","v":0},{"$f":"+'c15'!CC109","v":0},{"$f":"+'c15'!CA164","v":0},{"$f":"+'c15'!CC164","v":0},{"$f":"+'c15'!CA168","v":0},{"$f":"+'c15'!CC168","v":0},{"$f":"+'c15'!CA172","v":0},{"$f":"+'c15'!CC172","v":0},{"$f":"+'c15'!CA173","v":0},{"$f":"+'c15'!CC173","v":0},{"$f":"+'c15'!CA174","v":0},{"$f":"+'c15'!CC174","v":0},{"$f":"+'c15'!CA175","v":0},{"$f":"+'c15'!CC175","v":0},{"$f":"+'c15'!CA176","v":0},{"$f":"+'c15'!CC176","v":0},{"$f":"+'c15'!CA177","v":0},{"$f":"+'c15'!CC177","v":0}]
[45,"Societăţi civile medicale de specialitate ",{"$f":"+'c15'!CD109","v":0},{"$f":"+'c15'!CF109","v":0},{"$f":"+'c15'!$CD164","v":0},{"$f":"+'c15'!$CF164","v":0},{"$f":"+'c15'!$CD168","v":0},{"$f":"+'c15'!$CF168","v":0},{"$f":"+'c15'!$CD172","v":0},{"$f":"+'c15'!$CF172","v":0},{"$f":"+'c15'!$CD173","v":0},{"$f":"+'c15'!$CF173","v":0},{"$f":"+'c15'!$CD174","v":0},{"$f":"+'c15'!$CF174","v":0},{"$f":"+'c15'!$CD175","v":0},{"$f":"+'c15'!$CF175","v":0},{"$f":"+'c15'!$CD176","v":0},{"$f":"+'c15'!$CF176","v":0},{"$f":"+'c15'!$CD177","v":0},{"$f":"+'c15'!$CF177","v":0}]
[46,"Centre de transfuzie sanguină",{"$f":"+'c15'!CM109","v":0},{"$f":"+'c15'!CO109","v":0},{"$f":"+'c15'!CM164","v":0},{"$f":"+'c15'!CO164","v":0},{"$f":"+'c15'!CM168","v":0},{"$f":"+'c15'!CO168","v":0},{"$f":"+'c15'!CM172","v":0},{"$f":"+'c15'!CO172","v":0},{"$f":"+'c15'!CM173","v":0},{"$f":"+'c15'!CO173","v":0},{"$f":"+'c15'!CM174","v":0},{"$f":"+'c15'!CO174","v":0},{"$f":"+'c15'!CM175","v":0},{"$f":"+'c15'!CO175","v":0},{"$f":"+'c15'!CM176","v":0},{"$f":"+'c15'!CO176","v":0},{"$f":"+'c15'!CM177","v":0},{"$f":"+'c15'!CO177","v":0}]
[47,"Laboratoare medicale",{"$f":"+'c15'!CP109","v":0},{"$f":"+'c15'!CR109","v":0},{"$f":"+'c15'!CP164","v":0},{"$f":"+'c15'!CR164","v":0},{"$f":"+'c15'!CP168","v":0},{"$f":"+'c15'!CR168","v":0},{"$f":"+'c15'!CP172","v":0},{"$f":"+'c15'!CR172","v":0},{"$f":"+'c15'!CP173","v":0},{"$f":"+'c15'!CR173","v":0},{"$f":"+'c15'!CP174","v":0},{"$f":"+'c15'!CR174","v":0},{"$f":"+'c15'!CP175","v":0},{"$f":"+'c15'!CR175","v":0},{"$f":"+'c15'!CP176","v":0},{"$f":"+'c15'!CR176","v":0},{"$f":"+'c15'!CP177","v":0},{"$f":"+'c15'!CR177","v":0}]
[48,"Laboratoare de tehnică dentară",{"$f":"+'c15'!CS109","v":0},{"$f":"+'c15'!CU109","v":0},{"$f":"+'c15'!CS164","v":0},{"$f":"+'c15'!CU164","v":0},{"$f":"+'c15'!CS168","v":0},{"$f":"+'c15'!CU168","v":0},{"$f":"+'c15'!CS172","v":0},{"$f":"+'c15'!CU172","v":0},{"$f":"+'c15'!CS173","v":0},{"$f":"+'c15'!CU173","v":0},{"$f":"+'c15'!CS174","v":0},{"$f":"+'c15'!CU174","v":0},{"$f":"+'c15'!CS175","v":0},{"$f":"+'c15'!CU175","v":0},{"$f":"+'c15'!CS176","v":0},{"$f":"+'c15'!CU176","v":0},{"$f":"+'c15'!CS177","v":0},{"$f":"+'c15'!CU177","v":0}]
[49,"Unități de ambulanță, transportul pacienților și SMURD",{"$f":"+'c15'!DE109","v":0},{"$f":"+'c15'!DG109","v":0},{"$f":"+'c15'!DE164","v":0},{"$f":"+'c15'!DG164","v":0},{"$f":"+'c15'!DE168","v":0},{"$f":"+'c15'!DG168","v":0},{"$f":"+'c15'!DE172","v":0},{"$f":"+'c15'!DG172","v":0},{"$f":"+'c15'!DE173","v":0},{"$f":"+'c15'!DG173","v":0},{"$f":"+'c15'!DE174","v":0},{"$f":"+'c15'!DG174","v":0},{"$f":"+'c15'!DE175","v":0},{"$f":"+'c15'!DG175","v":0},{"$f":"+'c15'!DE176","v":0},{"$f":"+'c15'!DG176","v":0},{"$f":"+'c15'!DE177","v":0},{"$f":"+'c15'!DG177","v":0}]
[50,"Alte tipuri de cabinete medicale",0,0,0,0,0,0,0,0,0,0,0,0,0,0,0,0,0,0]
[51,"Unități rezidențiale pentru persoanele cu dizabilități",0,0,0,0,0,0,0,0,0,0,0,0,0,0,0,0,0,0]
[52,"Centre de zi pentru persoanele cu dizabilități",0,0,0,0,0,0,0,0,0,0,0,0,0,0,0,0,0,0]
[53,"Unități rezidențiale pentru persoanele vârstnice care oferă îngriji medicale în cadrul unității",0,0,0,0,0,0,0,0,0,0,0,0,0,0,0,0,0,0]
[54,"Alte unități de asistență socială care furnizează îngrijiri medicale",0,0,0,0,0,0,0,0,0,0,0,0,0,0,0,0,0,0]
[55,"Institute şi instituţii fără paturi *",{"$f":"+'c15'!CV109+'c15'!CY109+'c15'!DH109","v":0},{"$f":"+'c15'!CX109+'c15'!DA109+'c15'!DJ109","v":0},{"$f":"+'c15'!CV164+'c15'!CY164+'c15'!DH164","v":0},{"$f":"+'c15'!CX164+'c15'!DA164+'c15'!DJ164","v":0},{"$f":"+'c15'!CV168+'c15'!CY168+'c15'!DH168","v":0},{"$f":"+'c15'!CX168+'c15'!DA168+'c15'!DJ168","v":0},{"$f":"+'c15'!CV172+'c15'!CY172+'c15'!DH172","v":0},{"$f":"+'c15'!CX172+'c15'!DA172+'c15'!DJ172","v":0},{"$f":"+'c15'!CV173+'c15'!CY173+'c15'!DH173","v":0},{"$f":"+'c15'!CX173+'c15'!DA173+'c15'!DJ173","v":0},{"$f":"+'c15'!CV174+'c15'!CY174+'c15'!DH174","v":0},{"$f":"+'c15'!CX174+'c15'!DA174+'c15'!DJ174","v":0},{"$f":"+'c15'!CV175+'c15'!CY175+'c15'!DH175","v":0},{"$f":"+'c15'!CX175+'c15'!DA175+'c15'!DJ175","v":0},{"$f":"+'c15'!CV176+'c15'!CY176+'c15'!DH176","v":0},{"$f":"+'c15'!CX176+'c15'!DA176+'c15'!DJ176","v":0},{"$f":"+'c15'!CV177+'c15'!CY177+'c15'!DH177","v":0},{"$f":"+'c15'!CX177+'c15'!DA177+'c15'!DJ177","v":0}]
[56,"Alte unități *",0,0,0,0,0,0,0,0,0,0,0,0,0,0,0,0,0,0]
["Cap.8  Numărul personalului cu studii medii, existent la sfârşitul anului, pe tipuri de unităţi sanitare",null,null,null,null,null,{"$f":"IF(C329=E254,\"OK\",\"Err\")","v":"OK"},{"$f":"IF(D329=F254,\"OK\",\"Err\")","v":"OK"},{"$f":"IF(E329=E255,\"OK\",\"Err\")","v":"OK"},{"$f":"IF(F329=F255,\"OK\",\"Err\")","v":"OK"},{"$f":"IF(G329=E256,\"OK\",\"Err\")","v":"OK"},{"$f":"IF(H329=F256,\"OK\",\"Err\")","v":"OK"},{"$f":"IF(I329=E257,\"OK\",\"Err\")","v":"OK"},{"$f":"IF(J329=F257,\"OK\",\"Err\")","v":"OK"}]
["Nr. Crt.","Tipuri de unităţi sanitare","PERSONAL SANITAR MEDIU ",null,null,null,null,null,null,null,null,null,{"$f":"IF(K329=E258,\"OK\",\"Err\")","v":"OK"},{"$f":"IF(L329=F258,\"OK\",\"Err\")","v":"OK"}]
[null,null,"TOTAL","din care: femei","ASISTENTI MEDICALI",null,null,null,null,null,null,null,{"$f":"IF(M329=E259,\"OK\",\"Err\")","v":"OK"},{"$f":"IF(N329=F259,\"OK\",\"Err\")","v":"OK"},{"$f":"IF(O329=E260,\"OK\",\"Err\")","v":"OK"},{"$f":"IF(P329=F260,\"OK\",\"Err\")","v":"OK"}]
[null,null,null,null,"TOTAL ASIS-TENŢI","din care: femei","Asistenți obstetrică-ginecologie (moaşe)",null,"Asistenţi fiziokinetoterapeuţi",null,null,null,"Personal sanitar auxiliar",null,"Alt personal mediu angajat"]
[null,null,null,null,null,null,null,null,"Total","din care: femei","asistenţi fizioterapeuţi"]
[null,null,null,null,null,null,"Total","d.c: femei",null,null,"Total","d.c: femei","Total","d.c: femei","Total","d.c: femei"]
["A","B","1","2","3","4","5","6","7","8","9","10","11","12","13","14"]
[1,"Total personal cu studii medii",{"$f":"SUM(C331:C384)-C332-C334-C336-C339-C342-C344-C346-C348-C350-C363","v":0},{"$f":"SUM(D331:D384)-D332-D334-D336-D339-D342-D344-D346-D348-D350-D363","v":0},0,0,0,0,0,0,0,0,0,0,0,0]
[2," - din care: cu normă întreagă",{"$f":"+'c15'!Y62","v":0},{"$f":"+'c15'!AA62","v":0},{"$f":"+'c15'!$Y63","v":0},{"$f":"+'c15'!$AA63","v":0},{"$f":"+'c15'!$Y66","v":0},{"$f":"+'c15'!$AA66","v":0},{"$f":"+'c15'!$Y74","v":0},{"$f":"+'c15'!$AA74","v":0},{"$f":"+'c15'!$Y75","v":0},{"$f":"+'c15'!$AA75","v":0},{"$f":"+'c15'!$Y94","v":0},{"$f":"+'c15'!$AA94","v":0},{"$f":"+'c15'!Y95+'c15'!Y96+'c15'!Y97","v":0},{"$f":"+'c15'!AA95+'c15'!AA96+'c15'!AA97","v":0}]
[3,"Spitale (inclusiv institute cu paturi de spital)",{"$f":"+'c15'!G15","v":0},{"$f":"+'c15'!I15","v":0},{"$f":"+'c15'!G16","v":0},{"$f":"+'c15'!I16","v":0},{"$f":"+'c15'!G19","v":0},{"$f":"+'c15'!I19","v":0},{"$f":"+'c15'!G27","v":0},{"$f":"+'c15'!I27","v":0},{"$f":"+'c15'!G28","v":0},{"$f":"+'c15'!I28","v":0},{"$f":"+'c15'!G47","v":0},{"$f":"+'c15'!I47","v":0},{"$f":"+'c15'!G48+'c15'!G49+'c15'!G50","v":0},{"$f":"+'c15'!I48+'c15'!I49+'c15'!I50","v":0}]
[4," - din care: cu normă întreagă",{"$f":"+'c15'!$AB$62","v":0},{"$f":"+'c15'!$AD$62","v":0},{"$f":"+'c15'!$AB$63","v":0},{"$f":"+'c15'!$AD$63","v":0},{"$f":"+'c15'!$AB$66","v":0},{"$f":"+'c15'!$AD$66","v":0},{"$f":"+'c15'!$AB$74","v":0},{"$f":"+'c15'!$AD$74","v":0},{"$f":"+'c15'!$AB$75","v":0},{"$f":"+'c15'!$AD$75","v":0},{"$f":"+'c15'!$AB$94","v":0},{"$f":"+'c15'!$AD$94","v":0},{"$f":"+'c15'!$AB$95+'c15'!$AB$96+'c15'!$AB$97","v":0},{"$f":"+'c15'!$AD$95+'c15'!$AD$96+'c15'!$AD$97","v":0}]
[5,"Unități sanitare (inclusiv unități asimilate spitalelor) numai cu internare de zi*",0,0,0,0,0,0,0,0,0,0,0,0,0,0]
[6," - din care: cu normă întreagă",0,0,0,0,0,0,0,0,0,0,0,0,0,0]
[7,"Centre de sanatate cu paturi de spital",0,0,0,0,0,0,0,0,0,0,0,0,0,0]
[8," - din care: cu normă întreagă",0,0,0,0,0,0,0,0,0,0,0,0,0,0]
[9,"Centre de sănătate",0,0,0,0,0,0,0,0,0,0,0,0,0,0]
[10,"Centre de sănătate multifuncționale",0,0,0,0,0,0,0,0,0,0,0,0,0,0]
[11," - din care: cu normă întreagă",0,0,0,0,0,0,0,0,0,0,0,0,0,0]
[12,"Centre de sănătate mintală",0,0,0,0,0,0,0,0,0,0,0,0,0,0]
[13,"Unităţi medico-sociale",0,0,0,0,0,0,0,0,0,0,0,0,0,0]
[14," - din care: cu normă întreagă",0,0,0,0,0,0,0,0,0,0,0,0,0,0]
[15,"Sanatorii TBC",{"$f":"+'c15'!M15","v":0},{"$f":"+'c15'!O15","v":0},{"$f":"+'c15'!M16","v":0},{"$f":"+'c15'!O16","v":0},{"$f":"+'c15'!M19","v":0},{"$f":"+'c15'!O19","v":0},{"$f":"+'c15'!M27","v":0},{"$f":"+'c15'!O27","v":0},{"$f":"+'c15'!M28","v":0},{"$f":"+'c15'!O28","v":0},{"$f":"+'c15'!M47","v":0},{"$f":"+'c15'!O47","v":0},{"$f":"+'c15'!M48+'c15'!M49+'c15'!M50","v":0},{"$f":"+'c15'!O48+'c15'!O49+'c15'!O50","v":0}]
[16," - din care: cu normă întreagă",0,0,0,0,0,0,0,0,0,0,0,0,0,0]
[17,"Preventorii",{"$f":"+'c15'!P15","v":0},{"$f":"+'c15'!R15","v":0},{"$f":"+'c15'!P16","v":0},{"$f":"+'c15'!R16","v":0},{"$f":"+'c15'!P19","v":0},{"$f":"+'c15'!R19","v":0},{"$f":"+'c15'!P27","v":0},{"$f":"+'c15'!R27","v":0},{"$f":"+'c15'!P28","v":0},{"$f":"+'c15'!R28","v":0},{"$f":"+'c15'!P47","v":0},{"$f":"+'c15'!R47","v":0},{"$f":"+'c15'!P48+'c15'!P49+'c15'!P50","v":0},{"$f":"+'c15'!R48+'c15'!R49+'c15'!R50","v":0}]
[18," - din care: cu normă întreagă",0,0,0,0,0,0,0,0,0,0,0,0,0,0]
[19,"Sanatorii de nevroze sau de neuropsihiatrie",{"$f":"+'c15'!CS15","v":0},{"$f":"+'c15'!CU15","v":0},{"$f":"+'c15'!CS16","v":0},{"$f":"+'c15'!CU16","v":0},{"$f":"+'c15'!CS19","v":0},{"$f":"+'c15'!CU19","v":0},{"$f":"+'c15'!CS27","v":0},{"$f":"+'c15'!CU27","v":0},{"$f":"+'c15'!CS28","v":0},{"$f":"+'c15'!CU28","v":0},{"$f":"+'c15'!CS47","v":0},{"$f":"+'c15'!CU47","v":0},{"$f":"+'c15'!CS48+'c15'!CS49+'c15'!CS50","v":0},{"$f":"+'c15'!CU48+'c15'!CU49+'c15'!CU50","v":0}]
[20," - din care: cu normă întreagă",0,0,0,0,0,0,0,0,0,0,0,0,0,0]
[21,"Sanatorii balneare ",{"$f":"+'c15'!S15","v":0},{"$f":"+'c15'!U15","v":0},{"$f":"+'c15'!S16","v":0},{"$f":"+'c15'!U16","v":0},{"$f":"+'c15'!S19","v":0},{"$f":"+'c15'!U19","v":0},{"$f":"+'c15'!S27","v":0},{"$f":"+'c15'!U27","v":0},{"$f":"+'c15'!S28","v":0},{"$f":"+'c15'!U28","v":0},{"$f":"+'c15'!S47","v":0},{"$f":"+'c15'!U47","v":0},{"$f":"+'c15'!S48+'c15'!S49+'c15'!S50","v":0},{"$f":"+'c15'!U48+'c15'!U49+'c15'!U50","v":0}]
[22," - din care: cu normă întreagă",0,0,0,0,0,0,0,0,0,0,0,0,0,0]
[23,"Dispensare medicale ",{"$f":"+'c15'!V15","v":0},{"$f":"+'c15'!X15","v":0},{"$f":"+'c15'!V16","v":0},{"$f":"+'c15'!X16","v":0},{"$f":"+'c15'!V19","v":0},{"$f":"+'c15'!X19","v":0},{"$f":"+'c15'!V27","v":0},{"$f":"+'c15'!X27","v":0},{"$f":"+'c15'!V28","v":0},{"$f":"+'c15'!X28","v":0},{"$f":"+'c15'!V47","v":0},{"$f":"+'c15'!X47","v":0},{"$f":"+'c15'!V48+'c15'!V49+'c15'!V50","v":0},{"$f":"+'c15'!X48+'c15'!X49+'c15'!X50","v":0}]
[24,"Cabinete medicale şcolare ",{"$f":"+'c15'!Y15","v":0},{"$f":"+'c15'!AA15","v":0},{"$f":"+'c15'!Y16","v":0},{"$f":"+'c15'!AA16","v":0},{"$f":"+'c15'!Y19","v":0},{"$f":"+'c15'!AA19","v":0},{"$f":"+'c15'!Y27","v":0},{"$f":"+'c15'!AA27","v":0},{"$f":"+'c15'!Y28","v":0},{"$f":"+'c15'!AA28","v":0},{"$f":"+'c15'!Y47","v":0},{"$f":"+'c15'!AA47","v":0},{"$f":"+'c15'!Y48+'c15'!Y49+'c15'!Y50","v":0},{"$f":"+'c15'!AA48+'c15'!AA49+'c15'!AA50","v":0}]
[25,"Cabinete medicale studenţeşti",{"$f":"+'c15'!AB15","v":0},{"$f":"+'c15'!AD15","v":0},{"$f":"+'c15'!AB16","v":0},{"$f":"+'c15'!AD16","v":0},{"$f":"+'c15'!AB19","v":0},{"$f":"+'c15'!AD19","v":0},{"$f":"+'c15'!AB27","v":0},{"$f":"+'c15'!AD27","v":0},{"$f":"+'c15'!AB28","v":0},{"$f":"+'c15'!AD28","v":0},{"$f":"+'c15'!AB47","v":0},{"$f":"+'c15'!AD47","v":0},{"$f":"+'c15'!AB48+'c15'!AB49+'c15'!AB50","v":0},{"$f":"+'c15'!AD48+'c15'!AD49+'c15'!AD50","v":0}]
[26,"Cabinete independente de medicină generală",{"$f":"'c15'!AE15","v":0},{"$f":"'c15'!AG15","v":0},{"$f":"'c15'!AE16","v":0},{"$f":"'c15'!AG16","v":0},{"$f":"'c15'!AE19","v":0},{"$f":"'c15'!AG19","v":0},{"$f":"'c15'!AE27","v":0},{"$f":"'c15'!AG27","v":0},{"$f":"'c15'!AE28","v":0},{"$f":"'c15'!AG28","v":0},{"$f":"'c15'!AE47","v":0},{"$f":"'c15'!AG47","v":0},{"$f":"+'c15'!AE48+'c15'!AE49+'c15'!AE50","v":0},{"$f":"+'c15'!AG48+'c15'!AG49+'c15'!AG50","v":0}]
[27,"Cabinete independente de medicină de familie ",{"$f":"+'c15'!AH15","v":0},{"$f":"+'c15'!AJ15","v":0},{"$f":"+'c15'!AH16","v":0},{"$f":"+'c15'!AJ16","v":0},{"$f":"+'c15'!AH19","v":0},{"$f":"+'c15'!AJ19","v":0},{"$f":"+'c15'!AH27","v":0},{"$f":"+'c15'!AJ27","v":0},{"$f":"+'c15'!AH28","v":0},{"$f":"+'c15'!AJ28","v":0},{"$f":"+'c15'!AH47","v":0},{"$f":"+'c15'!AJ47","v":0},{"$f":"+'c15'!AH48+'c15'!AH49+'c15'!AH50","v":0},{"$f":"+'c15'!AJ48+'c15'!AJ49+'c15'!AJ50","v":0}]
[28,"Societăţi medicale civile ",{"$f":"+'c15'!$AK15","v":0},{"$f":"+'c15'!$AM15","v":0},{"$f":"+'c15'!$AK16","v":0},{"$f":"+'c15'!$AM16","v":0},{"$f":"+'c15'!$AK19","v":0},{"$f":"+'c15'!$AM19","v":0},{"$f":"+'c15'!$AK27","v":0},{"$f":"+'c15'!$AM27","v":0},{"$f":"+'c15'!$AK28","v":0},{"$f":"+'c15'!$AM28","v":0},{"$f":"+'c15'!$AK47","v":0},{"$f":"+'c15'!$AM47","v":0},{"$f":"+'c15'!AK48+'c15'!AK49+'c15'!AK50","v":0},{"$f":"+'c15'!AM48+'c15'!AM49+'c15'!AM50","v":0}]
[29,"Farmacii",{"$f":"+'c15'!AN15","v":0},{"$f":"+'c15'!AP15","v":0},{"$f":"+'c15'!AN16","v":0},{"$f":"+'c15'!AP16","v":0},{"$f":"+'c15'!AN19","v":0},{"$f":"+'c15'!AP19","v":0},{"$f":"+'c15'!AN27","v":0},{"$f":"+'c15'!AP27","v":0},{"$f":"+'c15'!AN28","v":0},{"$f":"+'c15'!AP28","v":0},{"$f":"+'c15'!AN47","v":0},{"$f":"+'c15'!AP47","v":0},{"$f":"+'c15'!AN48+'c15'!AN49+'c15'!AN50","v":0},{"$f":"+'c15'!AP48+'c15'!AP49+'c15'!AP50","v":0}]
[30,"Puncte de lucru ale farmaciilor",{"$f":"+'c15'!AQ15","v":0},{"$f":"+'c15'!AS15","v":0},{"$f":"+'c15'!AQ16","v":0},{"$f":"+'c15'!AS16","v":0},{"$f":"+'c15'!AQ19","v":0},{"$f":"+'c15'!AS19","v":0},{"$f":"+'c15'!AQ27","v":0},{"$f":"+'c15'!AS27","v":0},{"$f":"+'c15'!AQ28","v":0},{"$f":"+'c15'!AS28","v":0},{"$f":"+'c15'!AQ47","v":0},{"$f":"+'c15'!AS47","v":0},{"$f":"+'c15'!AQ48+'c15'!AQ49+'c15'!AQ50","v":0},{"$f":"+'c15'!AS48+'c15'!AS49+'c15'!AS50","v":0}]
[31,"Drogherii",0,0,0,0,0,0,0,0,0,0,0,0,0,0]
[32,"Depozite farmaceutice",{"$f":"+'c15'!AT15","v":0},{"$f":"+'c15'!AV15","v":0},{"$f":"+'c15'!AT16","v":0},{"$f":"+'c15'!AV16","v":0},{"$f":"+'c15'!AT19","v":0},{"$f":"+'c15'!AV19","v":0},{"$f":"+'c15'!AT27","v":0},{"$f":"+'c15'!AV27","v":0},{"$f":"+'c15'!AT28","v":0},{"$f":"+'c15'!AV28","v":0},{"$f":"+'c15'!AT47","v":0},{"$f":"+'c15'!AV47","v":0},{"$f":"+'c15'!AT48+'c15'!AT49+'c15'!AT50","v":0},{"$f":"+'c15'!AV48+'c15'!AV49+'c15'!AV50","v":0}]
[33,"Policlinici",{"$f":"+'c15'!AW15","v":0},{"$f":"+'c15'!AY15","v":0},{"$f":"+'c15'!AW16","v":0},{"$f":"+'c15'!AY16","v":0},{"$f":"+'c15'!AW19","v":0},{"$f":"+'c15'!AY19","v":0},{"$f":"+'c15'!AW27","v":0},{"$f":"+'c15'!AY27","v":0},{"$f":"+'c15'!AW28","v":0},{"$f":"+'c15'!AY28","v":0},{"$f":"+'c15'!AW47","v":0},{"$f":"+'c15'!AY47","v":0},{"$f":"+'c15'!AW48+'c15'!AW49+'c15'!AW50","v":0},{"$f":"+'c15'!AY48+'c15'!AY49+'c15'!AY50","v":0}]
[34,"Centre de dializă și puncte ale centrelor de dializă",0,0,0,0,0,0,0,0,0,0,0,0,0,0]
[35," - din care: cu normă întreagă",0,0,0,0,0,0,0,0,0,0,0,0,0,0]
[36,"Centre de diagnostic şi tratament ",{"$f":"+'c15'!AZ15","v":0},{"$f":"+'c15'!BB15","v":0},{"$f":"+'c15'!AZ16","v":0},{"$f":"+'c15'!BB16","v":0},{"$f":"+'c15'!AZ19","v":0},{"$f":"+'c15'!BB19","v":0},{"$f":"+'c15'!AZ27","v":0},{"$f":"+'c15'!BB27","v":0},{"$f":"+'c15'!AZ28","v":0},{"$f":"+'c15'!BB28","v":0},{"$f":"+'c15'!AZ47","v":0},{"$f":"+'c15'!BB47","v":0},{"$f":"+'c15'!AZ48+'c15'!AZ49+'c15'!AZ50","v":0},{"$f":"+'c15'!BB48+'c15'!BB49+'c15'!BB50","v":0}]
[37,"Centre medicale de specialitate",{"$f":"+'c15'!BC15","v":0},{"$f":"+'c15'!BE15","v":0},{"$f":"+'c15'!BC16","v":0},{"$f":"+'c15'!BE16","v":0},{"$f":"+'c15'!BC19","v":0},{"$f":"+'c15'!BE19","v":0},{"$f":"+'c15'!BC27","v":0},{"$f":"+'c15'!BE27","v":0},{"$f":"+'c15'!BC28","v":0},{"$f":"+'c15'!BE28","v":0},{"$f":"+'c15'!BC47","v":0},{"$f":"+'c15'!BE47","v":0},{"$f":"+'c15'!BC48+'c15'!BC49+'c15'!BC50","v":0},{"$f":"+'c15'!BE48+'c15'!BE49+'c15'!BE50","v":0}]
[38,"Ambulatorii de specialitate ",{"$f":"+'c15'!BF15","v":0},{"$f":"+'c15'!BH15","v":0},{"$f":"+'c15'!BF16","v":0},{"$f":"+'c15'!BH16","v":0},{"$f":"+'c15'!BF19","v":0},{"$f":"+'c15'!BH19","v":0},{"$f":"+'c15'!BF27","v":0},{"$f":"+'c15'!BH27","v":0},{"$f":"+'c15'!BF28","v":0},{"$f":"+'c15'!BH28","v":0},{"$f":"+'c15'!BF47","v":0},{"$f":"+'c15'!BH47","v":0},{"$f":"+'c15'!BF48+'c15'!BF49+'c15'!BF50","v":0},{"$f":"+'c15'!BH48+'c15'!BH49+'c15'!BH50","v":0}]
[39,"Ambulatorii integrate spitalului ",{"$f":"+'c15'!BI15","v":0},{"$f":"+'c15'!BK15","v":0},{"$f":"+'c15'!BI16","v":0},{"$f":"+'c15'!BK16","v":0},{"$f":"+'c15'!BI19","v":0},{"$f":"+'c15'!BK19","v":0},{"$f":"+'c15'!BI27","v":0},{"$f":"+'c15'!BK27","v":0},{"$f":"+'c15'!BI28","v":0},{"$f":"+'c15'!BK28","v":0},{"$f":"+'c15'!BI47","v":0},{"$f":"+'c15'!BK47","v":0},{"$f":"+'c15'!BI48+'c15'!BI49+'c15'!BI50","v":0},{"$f":"+'c15'!BK48+'c15'!BK49+'c15'!BK50","v":0}]
[40,"Cabinete stomatologice şcolare ",0,0,0,0,0,0,0,0,0,0,0,0,0,0]
[41,"Cabinete stomatologice studenţeşti",0,0,0,0,0,0,0,0,0,0,0,0,0,0]
[42,"Cabinete stomatologice independente",{"$f":"+'c15'!BL15","v":0},{"$f":"+'c15'!BN15","v":0},{"$f":"+'c15'!BL16","v":0},{"$f":"+'c15'!BN16","v":0},{"$f":"+'c15'!BL19","v":0},{"$f":"+'c15'!BN19","v":0},{"$f":"+'c15'!BL27","v":0},{"$f":"+'c15'!BN27","v":0},{"$f":"+'c15'!BL28","v":0},{"$f":"+'c15'!BN28","v":0},{"$f":"+'c15'!BL47","v":0},{"$f":"+'c15'!BN47","v":0},{"$f":"+'c15'!BL48+'c15'!BL49+'c15'!BL50","v":0},{"$f":"+'c15'!BN48+'c15'!BN49+'c15'!BN50","v":0}]
[43,"Societăţi stomatologice civile medicale ",{"$f":"+'c15'!$BO15","v":0},{"$f":"+'c15'!$BQ15","v":0},{"$f":"+'c15'!$BO16","v":0},{"$f":"+'c15'!$BQ16","v":0},{"$f":"+'c15'!$BO19","v":0},{"$f":"+'c15'!$BQ19","v":0},{"$f":"+'c15'!$BO27","v":0},{"$f":"+'c15'!$BQ27","v":0},{"$f":"+'c15'!$BO28","v":0},{"$f":"+'c15'!$BQ28","v":0},{"$f":"+'c15'!$BO47","v":0},{"$f":"+'c15'!$BQ47","v":0},{"$f":"+'c15'!BO48+'c15'!BO49+'c15'!BO50","v":0},{"$f":"+'c15'!BQ48+'c15'!BQ49+'c15'!BQ50","v":0}]
[44,"Cabinete medicale independente de specialitate ",{"$f":"+'c15'!BR15","v":0},{"$f":"+'c15'!BT15","v":0},{"$f":"+'c15'!BR16","v":0},{"$f":"+'c15'!BT16","v":0},{"$f":"+'c15'!BR19","v":0},{"$f":"+'c15'!BT19","v":0},{"$f":"+'c15'!BR27","v":0},{"$f":"+'c15'!BT27","v":0},{"$f":"+'c15'!BR28","v":0},{"$f":"+'c15'!BT28","v":0},{"$f":"+'c15'!BR47","v":0},{"$f":"+'c15'!BT47","v":0},{"$f":"+'c15'!BR48+'c15'!BR49+'c15'!BR50","v":0},{"$f":"+'c15'!BT48+'c15'!BT49+'c15'!BT50","v":0}]
[45,"Societăţi civile medicale de specialitate ",{"$f":"+'c15'!$BU15","v":0},{"$f":"+'c15'!$BW15","v":0},{"$f":"+'c15'!$BU16","v":0},{"$f":"+'c15'!$BW16","v":0},{"$f":"+'c15'!$BU19","v":0},{"$f":"+'c15'!$BW19","v":0},{"$f":"+'c15'!$BU27","v":0},{"$f":"+'c15'!$BW27","v":0},{"$f":"+'c15'!$BU28","v":0},{"$f":"+'c15'!$BW28","v":0},{"$f":"+'c15'!$BU47","v":0},{"$f":"+'c15'!$BW47","v":0},{"$f":"+'c15'!BU48+'c15'!BU49+'c15'!BU50","v":0},{"$f":"+'c15'!BW48+'c15'!BW49+'c15'!BW50","v":0}]
[46,"Centre de transfuzie sanguină",{"$f":"+'c15'!CD15","v":0},{"$f":"+'c15'!CF15","v":0},{"$f":"+'c15'!CD16","v":0},{"$f":"+'c15'!CF16","v":0},{"$f":"+'c15'!CD19","v":0},{"$f":"+'c15'!CF19","v":0},{"$f":"+'c15'!CD27","v":0},{"$f":"+'c15'!CF27","v":0},{"$f":"+'c15'!CD28","v":0},{"$f":"+'c15'!CF28","v":0},{"$f":"+'c15'!CD47","v":0},{"$f":"+'c15'!CF47","v":0},{"$f":"+'c15'!CD48+'c15'!CD49+'c15'!CD50","v":0},{"$f":"+'c15'!CF48+'c15'!CF49+'c15'!CF50","v":0}]
[47,"Laboratoare medicale",{"$f":"+'c15'!CG15","v":0},{"$f":"+'c15'!CI15","v":0},{"$f":"+'c15'!CG16","v":0},{"$f":"+'c15'!CI16","v":0},{"$f":"+'c15'!CG19","v":0},{"$f":"+'c15'!CI19","v":0},{"$f":"+'c15'!CG27","v":0},{"$f":"+'c15'!CI27","v":0},{"$f":"+'c15'!CG28","v":0},{"$f":"+'c15'!CI28","v":0},{"$f":"+'c15'!CG47","v":0},{"$f":"+'c15'!CI47","v":0},{"$f":"+'c15'!CG48+'c15'!CG49+'c15'!CG50","v":0},{"$f":"+'c15'!CI48+'c15'!CI49+'c15'!CI50","v":0}]
[48,"Laboratoare de tehnică dentară",{"$f":"+'c15'!CJ15","v":0},{"$f":"+'c15'!CL15","v":0},{"$f":"+'c15'!CJ16","v":0},{"$f":"+'c15'!CL16","v":0},{"$f":"+'c15'!CJ19","v":0},{"$f":"+'c15'!CL19","v":0},{"$f":"+'c15'!CJ27","v":0},{"$f":"+'c15'!CL27","v":0},{"$f":"+'c15'!CJ28","v":0},{"$f":"+'c15'!CL28","v":0},{"$f":"+'c15'!CJ47","v":0},{"$f":"+'c15'!CL47","v":0},{"$f":"+'c15'!CJ48+'c15'!CJ49+'c15'!CJ50","v":0},{"$f":"+'c15'!CL48+'c15'!CL49+'c15'!CL50","v":0}]
[49,"Unități de ambulanță, transportul pacienților și SMURD",{"$f":"+'c15'!CV15","v":0},{"$f":"+'c15'!CX15","v":0},{"$f":"+'c15'!CV16","v":0},{"$f":"+'c15'!CX16","v":0},{"$f":"+'c15'!CV19","v":0},{"$f":"+'c15'!CX19","v":0},{"$f":"+'c15'!CV27","v":0},{"$f":"+'c15'!CX27","v":0},{"$f":"+'c15'!CV28","v":0},{"$f":"+'c15'!CX28","v":0},{"$f":"+'c15'!CV47","v":0},{"$f":"+'c15'!CX47","v":0},{"$f":"+'c15'!CV48+'c15'!CV49+'c15'!CV50","v":0},{"$f":"+'c15'!CX48+'c15'!CX49+'c15'!CX50","v":0}]
[50,"Alte tipuri de cabinete medicale",0,0,0,0,0,0,0,0,0,0,0,0,0,0]
[51,"Unitati rezidentiale pentru persoanele cu dizabilități",0,0,0,0,0,0,0,0,0,0,0,0,0,0]
[52,"Centre de zi pentru persoanele cu dizabilități",0,0,0,0,0,0,0,0,0,0,0,0,0,0]
[53,"Unități rezidențiale pentru persoanele vârstnice care oferă îngriji medicale în cadrul unității",0,0,0,0,0,0,0,0,0,0,0,0,0,0]
[54,"Alte unități de asistență socială care furnizează îngrijiri medicale",0,0,0,0,0,0,0,0,0,0,0,0,0,0]
[55,"Institute şi instituţii fără paturi *",{"$f":"+'c15'!CM15+'c15'!CP15+'c15'!CY15","v":0},{"$f":"+'c15'!CO15+'c15'!CR15+'c15'!DA15","v":0},{"$f":"+'c15'!CM16+'c15'!CP16+'c15'!CY16","v":0},{"$f":"+'c15'!CO16+'c15'!CR16+'c15'!DA16","v":0},{"$f":"+'c15'!CM19+'c15'!CP19+'c15'!CY19","v":0},{"$f":"+'c15'!CO19+'c15'!CR19+'c15'!DA19","v":0},{"$f":"+'c15'!CM27+'c15'!CP27+'c15'!CY27","v":0},{"$f":"+'c15'!CO27+'c15'!CR27+'c15'!DA27","v":0},{"$f":"+'c15'!CM28+'c15'!CP28+'c15'!CY28","v":0},{"$f":"+'c15'!CO28+'c15'!CR28+'c15'!DA28","v":0},{"$f":"+'c15'!CM47+'c15'!CP47+'c15'!CY47","v":0},{"$f":"+'c15'!CO47+'c15'!CR47+'c15'!DA47","v":0},{"$f":"+'c15'!CM48+'c15'!CM49+'c15'!CM50+'c15'!CP48+'c15'!CP49+'c15'!CP50+'c15'!CY48+'c15'!CY49+'c15'!CY50","v":0},{"$f":"+'c15'!CO48+'c15'!CO49+'c15'!CO50+'c15'!CR48+'c15'!CR49+'c15'!CR50+'c15'!DA48+'c15'!DA49+'c15'!DA50","v":0}]
[56,"Alte unități **",0,0,0,0,0,0,0,0,0,0,0,0,0,0]
["Cap.9  Numărul medicilor (exclusiv stomatologi), după specialitatea medicală",null,null,null,{"$f":"IF(C391=E239,\"OK\",\"Err\")","v":"OK"},{"$f":"IF(D391=F239,\"OK\",\"Err\")","v":"OK"},{"$f":"IF(E242=G391,\"OK\",\"Err\")","v":"OK"},{"$f":"IF(F242=H391,\"OK\",\"Err\")","v":"OK"}]
["Nr. Crt.","Specialitatea medicală","Total","din care: femei","din total:"]
[]
[null,null,null,null,"Medici pentru copii",null,"Medici rezidenți"]
[null,null,null,null,"Total","din care: femei","Total","din care: femei"]
["A","B","1","2",3,4,5,6]
["1.  ","Total, din care:",{"$f":"SUM(C392:C444)","v":0},0,0,0,0,0]
["2.  ","Alergologie şi imunologie clinică",{"$f":"+'c15'!D111","v":0},{"$f":"+'c15'!F111","v":0},{"$f":"+'c15'!J111","v":0},{"$f":"+'c15'!L111","v":0},{"$f":"+'c15'!G111","v":0},{"$f":"+'c15'!I111","v":0}]
["3.  ","A.T.I.",{"$f":"+'c15'!D112","v":0},{"$f":"+'c15'!F112","v":0},{"$f":"+'c15'!J112","v":0},{"$f":"+'c15'!L112","v":0},{"$f":"+'c15'!G112","v":0},{"$f":"+'c15'!I112","v":0}]
["4.  ","Boli infecţioase",{"$f":"+'c15'!D113","v":0},{"$f":"+'c15'!F113","v":0},{"$f":"+'c15'!J113","v":0},{"$f":"+'c15'!L113","v":0},{"$f":"+'c15'!G113","v":0},{"$f":"+'c15'!I113","v":0}]
["5.  ","Cardiologie",{"$f":"+'c15'!D114","v":0},{"$f":"+'c15'!F114","v":0},{"$f":"+'c15'!J114","v":0},{"$f":"+'c15'!L114","v":0},{"$f":"+'c15'!G114","v":0},{"$f":"+'c15'!I114","v":0}]
["6.  ","Dermatovenerologie",{"$f":"+'c15'!D115","v":0},{"$f":"+'c15'!F115","v":0},{"$f":"+'c15'!J115","v":0},{"$f":"+'c15'!L115","v":0},{"$f":"+'c15'!G115","v":0},{"$f":"+'c15'!I115","v":0}]
["7.  ","Diabet zaharat, nutriţie şi boli metabolice",{"$f":"+'c15'!D116","v":0},{"$f":"+'c15'!F116","v":0},{"$f":"+'c15'!J116","v":0},{"$f":"+'c15'!L116","v":0},{"$f":"+'c15'!G116","v":0},{"$f":"+'c15'!I116","v":0}]
["8.  ","Endocrinologie",{"$f":"+'c15'!D117","v":0},{"$f":"+'c15'!F117","v":0},{"$f":"+'c15'!J117","v":0},{"$f":"+'c15'!L117","v":0},{"$f":"+'c15'!G117","v":0},{"$f":"+'c15'!I117","v":0}]
["9.  ","Expertiza medicală a capacităţii de muncă",{"$f":"+'c15'!D118","v":0},{"$f":"+'c15'!F118","v":0},{"$f":"+'c15'!J118","v":0},{"$f":"+'c15'!L118","v":0},{"$f":"+'c15'!G118","v":0},{"$f":"+'c15'!I118","v":0}]
["10.   ","Farmacologie clinică",{"$f":"+'c15'!D119","v":0},{"$f":"+'c15'!F119","v":0},{"$f":"+'c15'!J119","v":0},{"$f":"+'c15'!L119","v":0},{"$f":"+'c15'!G119","v":0},{"$f":"+'c15'!I119","v":0}]
["11.   ","Gastroenterologie",{"$f":"+'c15'!D120","v":0},{"$f":"+'c15'!F120","v":0},{"$f":"+'c15'!J120","v":0},{"$f":"+'c15'!L120","v":0},{"$f":"+'c15'!G120","v":0},{"$f":"+'c15'!I120","v":0}]
["12.   ","Genetică medicală",{"$f":"+'c15'!D121","v":0},{"$f":"+'c15'!F121","v":0},{"$f":"+'c15'!J121","v":0},{"$f":"+'c15'!L121","v":0},{"$f":"+'c15'!G121","v":0},{"$f":"+'c15'!I121","v":0}]
["13.   ","Geriatrie şi gerontologie",{"$f":"+'c15'!D122","v":0},{"$f":"+'c15'!F122","v":0},{"$f":"+'c15'!J122","v":0},{"$f":"+'c15'!L122","v":0},{"$f":"+'c15'!G122","v":0},{"$f":"+'c15'!I122","v":0}]
["14.   ","Hematologie",{"$f":"+'c15'!D123","v":0},{"$f":"+'c15'!F123","v":0},{"$f":"+'c15'!J123","v":0},{"$f":"+'c15'!L123","v":0},{"$f":"+'c15'!G123","v":0},{"$f":"+'c15'!I123","v":0}]
["15.   ","Medicină de familie",{"$f":"+'c15'!D124","v":0},{"$f":"+'c15'!F124","v":0},{"$f":"+'c15'!J124","v":0},{"$f":"+'c15'!L124","v":0},{"$f":"+'c15'!G124","v":0},{"$f":"+'c15'!I124","v":0},{"$f":"IF(E240=C405,\"OK\",\"Err\")","v":"OK"},{"$f":"IF(F240=D405,\"OK\",\"Err\")","v":"OK"}]
["16.   ","Medicină de urgenţă",{"$f":"+'c15'!D125","v":0},{"$f":"+'c15'!F125","v":0},{"$f":"+'c15'!J125","v":0},{"$f":"+'c15'!L125","v":0},{"$f":"+'c15'!G125","v":0},{"$f":"+'c15'!I125","v":0}]
["17.   ","Medicină internă",{"$f":"+'c15'!D126","v":0},{"$f":"+'c15'!F126","v":0},{"$f":"+'c15'!J126","v":0},{"$f":"+'c15'!L126","v":0},{"$f":"+'c15'!G126","v":0},{"$f":"+'c15'!I126","v":0}]
["18.   ","Medicină generală",{"$f":"+'c15'!D127","v":0},{"$f":"+'c15'!F127","v":0},{"$f":"+'c15'!J127","v":0},{"$f":"+'c15'!L127","v":0},{"$f":"+'c15'!G127","v":0},{"$f":"+'c15'!I127","v":0}]
["19.   ","Medicina muncii",{"$f":"+'c15'!D128","v":0},{"$f":"+'c15'!F128","v":0},{"$f":"+'c15'!J128","v":0},{"$f":"+'c15'!L128","v":0},{"$f":"+'c15'!G128","v":0},{"$f":"+'c15'!I128","v":0}]
["20.","Medicină sportivă",{"$f":"+'c15'!D129","v":0},{"$f":"+'c15'!F129","v":0},{"$f":"+'c15'!J129","v":0},{"$f":"+'c15'!L129","v":0},{"$f":"+'c15'!G129","v":0},{"$f":"+'c15'!I129","v":0}]
["21.","Nefrologie",{"$f":"+'c15'!D130","v":0},{"$f":"+'c15'!F130","v":0},{"$f":"+'c15'!J130","v":0},{"$f":"+'c15'!L130","v":0},{"$f":"+'c15'!G130","v":0},{"$f":"+'c15'!I130","v":0}]
["22.","Neonatologie",{"$f":"+'c15'!D131","v":0},{"$f":"+'c15'!F131","v":0},{"$f":"+'c15'!J131","v":0},{"$f":"+'c15'!L131","v":0},{"$f":"+'c15'!G131","v":0},{"$f":"+'c15'!I131","v":0}]
["23.","Neurologie",{"$f":"+'c15'!D132","v":0},{"$f":"+'c15'!F132","v":0},{"$f":"+'c15'!J132","v":0},{"$f":"+'c15'!L132","v":0},{"$f":"+'c15'!G132","v":0},{"$f":"+'c15'!I132","v":0}]
["24.","Neurologie pediatrică",{"$f":"+'c15'!D133","v":0},{"$f":"+'c15'!F133","v":0},{"$f":"+'c15'!J133","v":0},{"$f":"+'c15'!L133","v":0},{"$f":"+'c15'!G133","v":0},{"$f":"+'c15'!I133","v":0}]
["25.","Oncologie medicală",{"$f":"+'c15'!D134","v":0},{"$f":"+'c15'!F134","v":0},{"$f":"+'c15'!J134","v":0},{"$f":"+'c15'!L134","v":0},{"$f":"+'c15'!G134","v":0},{"$f":"+'c15'!I134","v":0}]
["26.","Pediatrie",{"$f":"+'c15'!D135","v":0},{"$f":"+'c15'!F135","v":0},{"$f":"+'c15'!J135","v":0},{"$f":"+'c15'!L135","v":0},{"$f":"+'c15'!G135","v":0},{"$f":"+'c15'!I135","v":0}]
["27.","Pneumologie",{"$f":"+'c15'!D136","v":0},{"$f":"+'c15'!F136","v":0},{"$f":"+'c15'!J136","v":0},{"$f":"+'c15'!L136","v":0},{"$f":"+'c15'!G136","v":0},{"$f":"+'c15'!I136","v":0}]
["28.","Psihiatrie ",{"$f":"+'c15'!D137","v":0},{"$f":"+'c15'!F137","v":0},{"$f":"+'c15'!J137","v":0},{"$f":"+'c15'!L137","v":0},{"$f":"+'c15'!G137","v":0},{"$f":"+'c15'!I137","v":0}]
["29.","Psihiatrie pediatrică ",{"$f":"+'c15'!D138","v":0},{"$f":"+'c15'!F138","v":0},{"$f":"+'c15'!J138","v":0},{"$f":"+'c15'!L138","v":0},{"$f":"+'c15'!G138","v":0},{"$f":"+'c15'!I138","v":0}]
["30.","Radioterapie",{"$f":"+'c15'!D139","v":0},{"$f":"+'c15'!F139","v":0},{"$f":"+'c15'!J139","v":0},{"$f":"+'c15'!L139","v":0},{"$f":"+'c15'!G139","v":0},{"$f":"+'c15'!I139","v":0}]
["31.","Recuperare, medicină fizică şi balneologie",{"$f":"+'c15'!D140","v":0},{"$f":"+'c15'!F140","v":0},{"$f":"+'c15'!J140","v":0},{"$f":"+'c15'!L140","v":0},{"$f":"+'c15'!G140","v":0},{"$f":"+'c15'!I140","v":0}]
["32.","Reumatologie",{"$f":"+'c15'!D141","v":0},{"$f":"+'c15'!F141","v":0},{"$f":"+'c15'!J141","v":0},{"$f":"+'c15'!L141","v":0},{"$f":"+'c15'!G141","v":0},{"$f":"+'c15'!I141","v":0}]
["33.","Chirurgie cardiovasculară",{"$f":"+'c15'!D142","v":0},{"$f":"+'c15'!F142","v":0},{"$f":"+'c15'!J142","v":0},{"$f":"+'c15'!L142","v":0},{"$f":"+'c15'!G142","v":0},{"$f":"+'c15'!I142","v":0}]
["34.","Chirurgie generală",{"$f":"+'c15'!D143","v":0},{"$f":"+'c15'!F143","v":0},{"$f":"+'c15'!J143","v":0},{"$f":"+'c15'!L143","v":0},{"$f":"+'c15'!G143","v":0},{"$f":"+'c15'!I143","v":0}]
["35.","Chirurgie orală şi maxilo- facială",{"$f":"+'c15'!D144","v":0},{"$f":"+'c15'!F144","v":0},{"$f":"+'c15'!J144","v":0},{"$f":"+'c15'!L144","v":0},{"$f":"+'c15'!G144","v":0},{"$f":"+'c15'!I144","v":0}]
["36.","Chirurgie pediatrică",{"$f":"+'c15'!D145","v":0},{"$f":"+'c15'!F145","v":0},{"$f":"+'c15'!J145","v":0},{"$f":"+'c15'!L145","v":0},{"$f":"+'c15'!G145","v":0},{"$f":"+'c15'!I145","v":0}]
["37.","Chirurgie plastică-microchir. reconstructivă",{"$f":"+'c15'!D146","v":0},{"$f":"+'c15'!F146","v":0},{"$f":"+'c15'!J146","v":0},{"$f":"+'c15'!L146","v":0},{"$f":"+'c15'!G146","v":0},{"$f":"+'c15'!I146","v":0}]
["38.","Chirurgie toracică",{"$f":"+'c15'!D147","v":0},{"$f":"+'c15'!F147","v":0},{"$f":"+'c15'!J147","v":0},{"$f":"+'c15'!L147","v":0},{"$f":"+'c15'!G147","v":0},{"$f":"+'c15'!I147","v":0}]
["39.","Chirurgie vasculară",{"$f":"+'c15'!D148","v":0},{"$f":"+'c15'!F148","v":0},{"$f":"+'c15'!J148","v":0},{"$f":"+'c15'!L148","v":0},{"$f":"+'c15'!G148","v":0},{"$f":"+'c15'!I148","v":0}]
["40."," Neurochirurgie",{"$f":"+'c15'!D149","v":0},{"$f":"+'c15'!F149","v":0},{"$f":"+'c15'!J149","v":0},{"$f":"+'c15'!L149","v":0},{"$f":"+'c15'!G149","v":0},{"$f":"+'c15'!I149","v":0}]
["41.","Obstetrică- ginecologie",{"$f":"+'c15'!D150","v":0},{"$f":"+'c15'!F150","v":0},{"$f":"+'c15'!J150","v":0},{"$f":"+'c15'!L150","v":0},{"$f":"+'c15'!G150","v":0},{"$f":"+'c15'!I150","v":0}]
["42.","Oftalmologie",{"$f":"+'c15'!D151","v":0},{"$f":"+'c15'!F151","v":0},{"$f":"+'c15'!J151","v":0},{"$f":"+'c15'!L151","v":0},{"$f":"+'c15'!G151","v":0},{"$f":"+'c15'!I151","v":0}]
["43.","Ortopedie şi traumatologie",{"$f":"+'c15'!D153+'c15'!D152","v":0},{"$f":"+'c15'!F153+'c15'!F152","v":0},{"$f":"+'c15'!J153+'c15'!J152","v":0},{"$f":"+'c15'!L153+'c15'!L152","v":0},{"$f":"+'c15'!G153+'c15'!G152","v":0},{"$f":"+'c15'!I153+'c15'!I152","v":0}]
["44.","O.R.L.",{"$f":"+'c15'!D154","v":0},{"$f":"+'c15'!F154","v":0},{"$f":"+'c15'!J154","v":0},{"$f":"+'c15'!L154","v":0},{"$f":"+'c15'!G154","v":0},{"$f":"+'c15'!I154","v":0}]
["45."," Urologie",{"$f":"+'c15'!D155","v":0},{"$f":"+'c15'!F155","v":0},{"$f":"+'c15'!J155","v":0},{"$f":"+'c15'!L155","v":0},{"$f":"+'c15'!G155","v":0},{"$f":"+'c15'!I155","v":0}]
["46.","Anatomie patologică",{"$f":"+'c15'!D156","v":0},{"$f":"+'c15'!F156","v":0},{"$f":"+'c15'!J156","v":0},{"$f":"+'c15'!L156","v":0},{"$f":"+'c15'!G156","v":0},{"$f":"+'c15'!I156","v":0}]
["47.","Epidemiologie",{"$f":"+'c15'!D157","v":0},{"$f":"+'c15'!F157","v":0},{"$f":"+'c15'!J157","v":0},{"$f":"+'c15'!L157","v":0},{"$f":"+'c15'!G157","v":0},{"$f":"+'c15'!I157","v":0}]
["48.","Igienă",{"$f":"+'c15'!D158","v":0},{"$f":"+'c15'!F158","v":0},{"$f":"+'c15'!J158","v":0},{"$f":"+'c15'!L158","v":0},{"$f":"+'c15'!G158","v":0},{"$f":"+'c15'!I158","v":0}]
["49.","Medicină de laborator",{"$f":"+'c15'!D159","v":0},{"$f":"+'c15'!F159","v":0},{"$f":"+'c15'!J159","v":0},{"$f":"+'c15'!L159","v":0},{"$f":"+'c15'!G159","v":0},{"$f":"+'c15'!I159","v":0}]
["50."," Medicină legală",{"$f":"+'c15'!D160","v":0},{"$f":"+'c15'!F160","v":0},{"$f":"+'c15'!J160","v":0},{"$f":"+'c15'!L160","v":0},{"$f":"+'c15'!G160","v":0},{"$f":"+'c15'!I160","v":0}]
["51."," Medicină nucleară",{"$f":"+'c15'!D161","v":0},{"$f":"+'c15'!F161","v":0},{"$f":"+'c15'!J161","v":0},{"$f":"+'c15'!L161","v":0},{"$f":"+'c15'!G161","v":0},{"$f":"+'c15'!I161","v":0}]
["52.","Radiologie – imagistică medicală",{"$f":"+'c15'!D162","v":0},{"$f":"+'c15'!F162","v":0},{"$f":"+'c15'!J162","v":0},{"$f":"+'c15'!L162","v":0},{"$f":"+'c15'!G162","v":0},{"$f":"+'c15'!I162","v":0}]
["53.","Sănătate publică şi management",{"$f":"+'c15'!D163","v":0},{"$f":"+'c15'!F163","v":0},{"$f":"+'c15'!J163","v":0},{"$f":"+'c15'!L163","v":0},{"$f":"+'c15'!G163","v":0},{"$f":"+'c15'!I163","v":0}]
["54.","Altă specialitate medicală"]
["Cap.11 Asistenţa medicală de urgenţă "]
["Nr. Crt.","Număr de autosanitare la sfârșitul anului","Număr Solicitări",null,"Număr de pacienţi"]
[null,null,"Total","din care: rezolvate","Transportaţi","Asistaţi"]
["A","1",2,3,4,5]
["1.",0,0,0,0,0]
["Cap.12a Alocarea cheltuielilor din unitatile sanitare cu paturi si din unitatile din sfera asistentei sociale in care se furnizeaza si ingrijiri medicale, in anul financiar 2021, dupa suresele de finantare/venituri, pe categorii de cheltuieli si tipuri de unitati",null,null,null,null,null,null,null,null,null,null,null,"in mii lei"]
["Nr. rând","Tipuri de unităţi sanitare","Cheltuieli curente","din cheltuieli curente (col.1) pe surse de finanțare",null,null,null,null,null,null,null,"Cheltuieli de capital"]
[null,null,null,"Bugetul de stat","Bugetele locale și județene","Fondul Național Unic de Asigurări Sociale de Sănătate","Fonduri proprii",null,null,"Societăți private de asigurări","Angajatori, pt. controale periodice ale personalului propriu","Total","din care: din fonduri publice"]
[null,null,null,null,null,null,"Total","din care:"]
[null,null,null,null,null,null,null,"plați directe de la pacienți","donatii"]
["A","B",1,2,3,4,5,6,7,8,9,10,11]
["1.    ","Spitale (inclusiv institute cu paturi de spital)",{"$f":"SUM(D456:G456)+SUM(J456:K456)","v":0},0,0,0,0,0,0,0,0,0,0]
["2.    ","Unități sanitare (inclusiv unități asimilate spitalelor) numai cu internare de zi*",{"$f":"SUM(D457:G457)+SUM(J457:K457)","v":0},0,0,0,0,0,0,0,0,0,0]
["3.    ","Centre de sănătate cu paturi de spital",{"$f":"SUM(D458:G458)+SUM(J458:K458)","v":0},0,0,0,0,0,0,0,0,0,0]
["4.    ","Centre de sănătate multifuncționale",0,0,0,0,0,0,0,0,0,0,0]
["5.    ","Unităţi medico-sociale",0,0,0,0,0,0,0,0,0,0,0]
["6.    ","Sanatorii TBC",0,0,0,0,0,0,0,0,0,0,0]
["7.    ","Preventorii",0,0,0,0,0,0,0,0,0,0,0]
["8.    ","Sanatorii de nevroze sau de neuropsihiatrie",0,0,0,0,0,0,0,0,0,0,0]
["9.    ","Sanatorii balneare",0,0,0,0,0,0,0,0,0,0,0]
["10.    ","Centre de dializă și puncte ale centrelor de dializă",0,0,0,0,0,0,0,0,0,0,0]
["11.    ","Unitati rezidentiale pentru persoanele cu dizabilități",0,0,0,0,0,0,0,0,0,0,0]
["12.    ","Unități rezidențiale pentru persoanele vârstnice care oferă îngriji medicale în cadrul unității",0,0,0,0,0,0,0,0,0,0,0]
["Cap.12b Alocarea cheltuielilor din unitatile sanitare si din unitatile din sfera asistentei sociale in care se furnizeaza si ingrijiri medicale, care acorda asistenta medicala ambulatorie,in anul financiar 2021, dupa sursele de finantare/venituri,pe  categorii de cheltuieli si tipuri de unitati",null,null,null,null,null,null,null,null,null,null,null,"in mii lei"]
["Nr. rând","Tipuri de unităţi sanitare","Cheltuieli curente","din cheltuieli curente (col.2) pe surse de finantare",null,null,null,null,null,null,null,"Cheltuieli de capital"]
[null,null,null,"Bugetul de stat","Bugetele locale și județene","Fondul Național Unic de Asigurări Sociale de Sănătate","Fonduri proprii",null,null,"Societăți private de asigurări","Angajatori, pt. controale periodice ale personalului propriu","Total","din care din fonduri publice"]
[null,null,null,null,null,null,"Total","din care:"]
[null,null,null,null,null,null,null,"plați directe de la pacienți","donații"]
["A","B",1,2,3,4,5,6,7,8,9,10,11]
["1.    ","Centre de sănătate",{"$f":"SUM(D474:G474)+SUM(J474:K474)","v":0},0,0,0,0,0,0,0,0,0,0]
["2.    ","Centre de sănătate mintală",{"$f":"SUM(D475:G475)+SUM(J475:K475)","v":0},0,0,0,0,0,0,0,0,0,0]
["3.    ","Dispensare medicale ",0,0,0,0,0,0,0,0,0,0,0]
["4.    ","Cabinete medicale şcolare ",0,0,0,0,0,0,0,0,0,0,0]
["5.    ","Cabinete medicale studenţeşti",0,0,0,0,0,0,0,0,0,0,0]
["6.    ","Cabinete independente de medicale de medicină generală",0,0,0,0,0,0,0,0,0,0,0]
["7.    ","Cabinete independente de medicină de familie",0,0,0,0,0,0,0,0,0,0,0]
["8.    ","Societăţi medicale civile 2)",0,0,0,0,0,0,0,0,0,0,0]
["9.    ","Farmacii",0,0,0,0,0,0,0,0,0,0,0]
["10.    ","Puncte de lucru ale farmaciilor",0,0,0,0,0,0,0,0,0,0,0]
["11.    ","Drogherii",0,0,0,0,0,0,0,0,0,0,0]
["12.    ","Depozite farmaceutice",0,0,0,0,0,0,0,0,0,0,0]
["13.    ","Policlinici",0,0,0,0,0,0,0,0,0,0,0]
["14.    ","Centre de diagnostic şi tratament",0,0,0,0,0,0,0,0,0,0,0]
["15.    ","Centre medicale de specialitate",0,0,0,0,0,0,0,0,0,0,0]
["16.    ","Ambulatorii de specialitate",0,0,0,0,0,0,0,0,0,0,0]
["17.    ","Ambulatorii integrate spitalului",0,0,0,0,0,0,0,0,0,0,0]
["18.    ","Cabinete stomatologice şcolare ",0,0,0,0,0,0,0,0,0,0,0]
["19.    ","Cabinete stomatologice studenţeşti",0,0,0,0,0,0,0,0,0,0,0]
["20.    ","Cabinete stomatologice independente",0,0,0,0,0,0,0,0,0,0,0]
["21.    ","Societăţi stomatologice civile medicale ",0,0,0,0,0,0,0,0,0,0,0]
["22.    ","Cabinete medicale independente de specialitate",0,0,0,0,0,0,0,0,0,0,0]
["23.    ","Societăţi civile medicale de specialitate",0,0,0,0,0,0,0,0,0,0,0]
["24.    ","Centre de transfuzie sanguină",0,0,0,0,0,0,0,0,0,0,0]
["25.    ","Laboratoare medicale",0,0,0,0,0,0,0,0,0,0,0]
["26.    ","Laboratoare de tehnică dentară",0,0,0,0,0,0,0,0,0,0,0]
["27.    ","Unități de ambulanță, transportul pacienților și SMURD",0,0,0,0,0,0,0,0,0,0,0]
["28.    ","Alte tipuri de cabinete medicale",0,0,0,0,0,0,0,0,0,0,0]
["29.    ","Centre de zi pentru persoanele cu dizabilități",0,0,0,0,0,0,0,0,0,0,0]
["30.    ","Alte unități de asistență socială care furnizează îngrijiri medicale",{"$f":"SUM(D503:G503)+SUM(J503:K503)","v":0},0,0,0,0,0,0,0,0,0,0]
["31.    ","Institute şi instituţii fără paturi *",0,0,0,0,0,0,0,0,0,0,0]
["32.    ","Alte unități **",{"$f":"SUM(D505:G505)+SUM(J505:K505)","v":0},0,0,0,0,0,0,0,0,0,0]
["Cap.13a Alocarea cheltuielilor din unitățile sanitare și din unitatile din sfera asistentei sociale in care se furnizeaza si ingrijiri medicale, care acorda asistenta medicala ambulatorie, in anul financiar 2021, pe tipuri de unitati si servicii",null,null,null,null,null,null,null,null,null,null,"in mii lei"]
["Nr. rând","Tipuri de unităţi sanitare","Cheltuieli curente din cap.12a, col.1","din care pe categorii principale de servicii"]
[null,null,null,"servicii medicale de:",null,null,null,null,null,"servicii medicale paraclinice",null,"medicamente"]
[null,null,null,"spit.continuă pt.cazuri acute și cronice","spitalizare de zi","recuperare, reabilitare","ambulanța și transportul pacienților","medicina muncii","prevenție și sănătate publică","total din care:","din care: diagnos- ticare imagistică"]
[]
["A","B",1,2,3,4,5,6,7,8,9,10]
["1.    ","Spitale (inclusiv institute cu paturi de spital)",0,0,0,0,0,0,0,0,0,0]
["2.    ","Unități sanitare (inclusiv unități asimilate spitalelor) numai cu internare de zi*",0,0,0,0,0,0,0,0,0,0]
["3.    ","Centre de sănătate cu paturi de spital",0,0,0,0,0,0,0,0,0,0]
["4.    ","Centre de sănătate multifuncționale",0,0,0,0,0,0,0,0,0,0]
["5.    ","Unităţi medico-sociale",0,0,0,0,0,0,0,0,0,0]
["6.    ","Sanatorii TBC",0,0,0,0,0,0,0,0,0,0]
["7.    ","Preventorii",0,0,0,0,0,0,0,0,0,0]
["8.    ","Sanatorii de nevroze sau de neuropsihiatrie",0,0,0,0,0,0,0,0,0,0]
["9.    ","Sanatorii balneare",0,0,0,0,0,0,0,0,0,0]
["10.    ","Centre de dializă și puncte ale centrelor de dializă",0,0,0,0,0,0,0,0,0,0]
["11.    ","Unități rezidențiale pentru persoanele cu dizabilități",0,0,0,0,0,0,0,0,0,0]
["12.    ","Unități rezidențiale pentru persoanele vârstnice care oferă îngriji medicale în cadrul unității",0,0,0,0,0,0,0,0,0,0]
["Cap.13b Alocarea cheltuielilor din unitatile sanitare si din unitatile din sfera asistentei sociale in care se furnizeaza si ingrijiri medicale, care acorda asistenta medicala ambulatorie, in anul financiar 2021, pe tipuri de unitati si servicii",null,null,null,null,null,null,null,null,null,null,null,null,"in mii lei"]
["Nr. rând","Tipuri de unităţi sanitare","Cheltuieli curente (din cap.12b col.1)","din care: pe categorii principale de servicii"]
[null,null,null,"medicale primare","imunizări","medicale de specialitate","medicale  Stomatologice","medicale de recuperare-reabilitare","medicale de îngrijire la domiciliu","edicale de planificare familială","ambulanţă şi transposturl pacienţilor","medicina muncii","medicale paraclinice"]
[null,null,null,null,null,null,null,null,null,null,null,null,"Total","din care: diagnos- ticare imagistică"]
["A","B",1,2,3,4,5,6,7,8,9,10,11,12]
["1.    ","Centre de sănătate",0,0,0,0,0,0,0,0,0,0,0,0]
["2.    ","Centre de sănătate mintală",0,0,0,0,0,0,0,0,0,0,0,0]
["3.    ","Dispensare medicale ",0,0,0,0,0,0,0,0,0,0,0,0]
["4.    ","Cabinete medicale şcolare ",0,0,0,0,0,0,0,0,0,0,0,0]
["5.    ","Cabinete medicale studenţeşti",0,0,0,0,0,0,0,0,0,0,0,0]
["6.    ","Cabinete independente de medicină generală",0,0,0,0,0,0,0,0,0,0,0,0]
["7.    ","Cabinete independente de medicină de familie",0,0,0,0,0,0,0,0,0,0,0,0]
["8.    ","Societăţi medicale civile",0,0,0,0,0,0,0,0,0,0,0,0]
["9.    ","Farmacii",0,0,0,0,0,0,0,0,0,0,0,0]
["10.    ","Puncte de lucru ale farmaciilor",0,0,0,0,0,0,0,0,0,0,0,0]
["11.    ","Drogherii",0,0,0,0,0,0,0,0,0,0,0,0]
["12.    ","Depozite farmaceutice",0,0,0,0,0,0,0,0,0,0,0,0]
["13.    ","Policlinici",0,0,0,0,0,0,0,0,0,0,0,0]
["14.    ","Centre de diagnostic şi tratament",0,0,0,0,0,0,0,0,0,0,0,0]
["15.    ","Centre medicale de specialitate",0,0,0,0,0,0,0,0,0,0,0,0]
["16.    ","Ambulatorii de specialitate",0,0,0,0,0,0,0,0,0,0,0,0]
["17.    ","Ambulatorii integrate spitalului",0,0,0,0,0,0,0,0,0,0,0,0]
["18.    ","Cabinete stomatologice şcolare ",0,0,0,0,0,0,0,0,0,0,0,0]
["19.    ","Cabinete stomatologice studenţeşti",0,0,0,0,0,0,0,0,0,0,0,0]
["20.    ","Cabinete stomatologice independente",0,0,0,0,0,0,0,0,0,0,0,0]
["21.    ","Societăţi stomatologice civile medicale ",0,0,0,0,0,0,0,0,0,0,0,0]
["22.    ","Cabinete medicale independente de specialitate",0,0,0,0,0,0,0,0,0,0,0,0]
["23.    ","Societăţi civile medicale de specialitate",0,0,0,0,0,0,0,0,0,0,0,0]
["24.    ","Centre de transfuzie sanguină",0,0,0,0,0,0,0,0,0,0,0,0]
["25.    ","Laboratoare medicale",0,0,0,0,0,0,0,0,0,0,0,0]
["26.    ","Laboratoare de tehnică dentară",0,0,0,0,0,0,0,0,0,0,0,0]
["27.    ","Unități de ambulanță, transportul pacienților și SMURD",0,0,0,0,0,0,0,0,0,0,0,0]
["28.    ","Alte tipuri de cabinete medicale",0,0,0,0,0,0,0,0,0,0,0,0]
["29.    ","Centre de zi pentru persoanele cu dizabilități",0,0,0,0,0,0,0,0,0,0,0,0]
["30.    ","Alte unități de asistență socială care furnizează îngrijiri medicale",0,0,0,0,0,0,0,0,0,0,0,0]
["31.    ","Institute şi instituţii fără paturi *",0,0,0,0,0,0,0,0,0,0,0,0]
["32.    ","Alte unități **",0,0,0,0,0,0,0,0,0,0,0,0]

{"sheet":"c1","index":1,"n_rows":66,"n_cols":16,"rows_kept":66,"cut":false,"hidden":false,"merged":[[42,12,42,13],[45,0,45,1],[39,0,39,15],[41,0,43,0],[41,1,43,1],[41,2,41,3],[41,4,43,4],[41,5,43,5],[41,6,43,6],[41,7,43,7],[41,8,41,11],[42,14,42,15],[41,12,41,15],[42,2,43,2],[42,3,43,3],[42,8,42,9],[42,10,42,11],[14,0,16,0],[17,0,19,0],[24,0,26,0],[24,1,26,1],[24,7,24,10],[25,3,26,3],[25,4,25,6],[25,7,26,7],[25,8,25,10],[28,0,28,1],[29,0,31,0],[32,0,34,0],[24,3,24,6],[24,2,26,2],[13,0,13,1],[5,0,5,10],[9,0,11,0],[9,1,11,1],[9,2,11,2],[9,3,9,6],[9,7,9,10],[10,3,11,3],[10,4,10,6],[10,7,11,7],[10,8,10,10]]}
[]
[]
[]
[]
[]
[" Cap.1. ACTIVITATEA CABINETELOR  MEDICAL E DE  FAMILIE, STOMATOLOGICE ŞI DE SPECIALITATE  (URBAN / RURAL)"]
[]
["1. Consultaţii şi tratamente în cabinetele medicale individuale"]
[]
["Mediul","Specificare","Rând","Consultaţii",null,null,null,"Tratamente"]
[null,null,null,"Total consultaţii","din care:",null,null,"Total tratamente","din care:"]
[null,null,null,null,"Medicină de familie","Stomatologie","Alte specialităţi",null,"Medicină de familie","Stomatologie","Alte specialităţi"]
["A","B","C",1,2,3,4,5,6,7,8]
["Total ",null,1,{"$f":"+D15+D16+D18+D19","v":0},0,0,0,0,0,0,0]
["urban","Adulţi    15 ani+",2,{"$f":"SUM(E15:G15)","v":0},0,0,0,{"$f":"SUM(I15:K15)","v":0},0,0,0]
[null,"Copii    0-14 ani",3,0,0,0,0,0,0,0,0]
[null,"din care: sub 1 an",4,0,0,0,0,0,0,0,0]
["rural","Adulţi    15 ani+",5,0,0,0,0,0,0,0,0]
[null,"Copii    0-14 ani",6,0,0,0,0,0,0,0,0]
[null,"din care: sub 1 an",7,0,0,0,0,0,0,0,0]
[]
[]
["2. Consultaţii şi tratamente în cabinetele din societăţile medicale civile"]
[]
["Mediul","Specificare","Rând","Consultaţii",null,null,null,"Tratamente"]
[null,null,null,"Total consultaţii","din care:",null,null,"Total tratamente","din care:"]
[null,null,null,null,"Medicină de familie","Stomatologie","Alte specialităţi",null,"Medicină de familie","Stomatologie","Alte specialităţi"]
["A","B","C",1,2,3,4,5,6,7,8]
["Total ",null,1,{"$f":"+D30+D31+D33+D34","v":0},0,0,0,0,0,0,0]
["urban","Adulţi    15 ani+",2,{"$f":"SUM(E30:G30)","v":0},0,0,0,{"$f":"SUM(I30:K30)","v":0},0,0,0]
[null,"Copii    0-14 ani",3,0,0,0,0,0,0,0,0]
[null,"din care: sub 1 an",4,0,0,0,0,0,0,0,0]
["rural","Adulţi    15 ani+",5,0,0,0,0,0,0,0,0]
[null,"Copii    0-14 ani",6,0,0,0,0,0,0,0,0]
[null,"din care: sub 1 an",7,0,0,0,0,0,0,0,0]
[]
["Notă: Datele din pct.2 (cabinetele din societăţile medicale civile) nu se raportează şi la pct.1 (cabinetele medicale individuale)"]
[]
[]
["Centre de permanență"]
[]
["Nr. crt.","Denumire Centru de permanenta","Localitati deservite",null,"Nr. cazuri rezolvate","Nr. cazuri trimise către unități spitalicești","Nr. medici","Nr. asistenți","Consultații",null,null,null,"Tratamente"]
[null,null,"U","R",null,null,null,null,"U",null,"R",null,"U",null,"R"]
[null,null,null,null,null,null,null,null,"adulți","copii","adulți","copii","adulți","copii","adulți","copii"]
["A","B",1,2,3,4,5,6,7,8,9,10,11,12,13,14]
[null,null,null,null,{"$f":"SUM(E47:E66)","v":0},0,0,0,{"$f":"SUM(I47:I66)","v":0},{"$f":"SUM(J47:J66)","v":0},0,0,0,0,0,0]
[null,null,null,null,0,0,0,0,0,0,0,0,0,0,0,0]
[null,null,null,null,0,0,0,0,0,0,0,0,0,0,0,0]
[null,null,null,null,0,0,0,0,0,0,0,0,0,0,0,0]
[null,null,null,null,0,0,0,0,0,0,0,0,0,0,0,0]
[null,null,null,null,0,0,0,0,0,0,0,0,0,0,0,0]
[null,null,null,null,0,0,0,0,0,0,0,0,0,0,0,0]
[null,null,null,null,0,0,0,0,0,0,0,0,0,0,0,0]
[null,null,null,null,0,0,0,0,0,0,0,0,0,0,0,0]
[null,null,null,null,0,0,0,0,0,0,0,0,0,0,0,0]
[null,null,null,null,0,0,0,0,0,0,0,0,0,0,0,0]
[null,null,null,null,0,0,0,0,0,0,0,0,0,0,0,0]
[null,null,null,null,0,0,0,0,0,0,0,0,0,0,0,0]
[null,null,null,null,0,0,0,0,0,0,0,0,0,0,0,0]
[null,null,null,null,0,0,0,0,0,0,0,0,0,0,0,0]
[null,null,null,null,0,0,0,0,0,0,0,0,0,0,0,0]
[null,null,null,null,0,0,0,0,0,0,0,0,0,0,0,0]
[null,null,null,null,0,0,0,0,0,0,0,0,0,0,0,0]
[null,null,null,null,0,0,0,0,0,0,0,0,0,0,0,0]
[null,null,null,null,0,0,0,0,0,0,0,0,0,0,0,0]
[null,null,null,null,0,0,0,0,0,0,0,0,0,0,0,0]

{"sheet":"c14","index":2,"n_rows":46,"n_cols":24,"rows_kept":46,"cut":false,"hidden":false,"merged":[[14,19,15,19],[14,20,15,20],[13,21,14,23],[14,2,15,2],[14,3,15,3],[14,4,15,4],[14,5,15,5],[14,6,15,6],[14,7,15,7],[14,8,15,8],[14,9,15,9],[14,14,15,14],[13,14,13,20],[14,15,15,15],[14,16,15,16],[14,17,15,17],[14,18,15,18],[13,0,15,0],[13,1,15,1],[13,2,13,9],[13,10,14,12],[13,13,15,13]]}
[]
[]
[]
[]
[]
["MS.60.4.4A"]
["CAP 14. CHELTUIELILE BUGETARE ÎN UNTĂŢILE SANITARE"]
[]
[]
["Anul ....................."]
[]
["1. Cheltuieli realizate"]
[]
["Specificare","Rând","CHELTUIELI REALIZATE - TOTAL, din care pentru:",null,null,null,null,null,null,null,"Cheltuieli realizate în spital raportate la:",null,null,"Total cheltuieli pentru medicamente","din care, cheltuieli efectuate pentru:",null,null,null,null,null,null,"Cheltuieli efectuate pentru medicamente în spital raportate la:"]
[null,null,"TOTAL CHELTUIELI","Spitalizare de zi","Cabinete şcolare   şi studenţeşti","Dispensare tbc.","Unităţi ambulatorii de specialitate","Unităţi sanitare balneare","Camera de gardă UPU/CPU","Spitale       (sanatorii tbc.)",null,null,null,null,"Spitalizare de zi","Cabinete şcolare   şi studenţeşti","Dispensare tbc.","Unităţi ambulatorii de specialitate","Unităţi sanitare balneare","Camera de gardă UPU/CPU","Spitale (sanatorii tbc.)"]
[null,null,null,null,null,null,null,null,null,null,"un pat","un bolnav","o zi spitalizare",null,null,null,null,null,null,null,null,"un pat","un bolnav","o zi spitalizare"]
["A","B",1,2,3,4,5,6,7,8,9,10,11,12,13,14,15,16,17,18,19,20,21,22]
["TOTAL",1,0,0,0,0,0,0,0,0,0,0,0,0,0,0,0,0,0,0,{"$f":"+SUM(C27:X27)+SUM(A36:X36)+SUM(A45:F45)","v":0},0,0,0]
["Clinic",2,0,0,0,0,0,0,0,0,0,0,0,0,0,0,0,0,0,0,{"$f":"+SUM(C28:X28)+SUM(A37:X37)+SUM(A46:F46)","v":0},0,0,0]
[]
[]
[]
["2. Repartizarea cheltuielilor pentru medicamente din spital pe secţiile şi compartimentele componente "]
[]
["Specificare","Rând","ATI","ATI COVID","ATI COVID COPII","Boli infecţioase","Boli profesionale  ","Cardiologie","Chirurgie cardio-vasculară","Chirurgie generală","Chirurgie maxilo- facială","Chirurgie pediatrică","Chirurgie plastică şi reparatorie","Chirurgie toracică","Chirurgie toracică  - tbc","Cronici","Dermato-venerologie","Diabet zaharat, nutriţie şi boli de metabolism","Endocrinologie","Gastro-enterologie","Geriatrie şi gerontologie","Ginecologie","Hematologie","Imunologie clinică şi alergologie"]
["A","B",1,2,3,4,5,6,7,8,9,10,11,12,13,14,15,16,17,18,19,20,21,22]
["TOTAL",1,0,0,0,0,0,0,0,0,0,0,0,0,0,0,0,0,0,0,0,0,0,0]
["CLINIC",2,0,0,0,0,0,0,0,0,0,0,0,0,0,0,0,0,0,0,0,0,0,0]
[]
[]
[]
[]
[]
["Medicină generală","Medicină internă","Nefrologie","Neonatologie şi prematuri","Neurochirurgie","Neurologie","Obstetrică","Obstetrică ginecologie","Oftalmologie","Oncologie medicală","O.R.L.","Ortopedie şi traumatologie","Pediatrie","Pneumologie","Pneumologie tbc","Psihiatrie","Psihiatrie acuţi","Psihiatrie cronici","Recuperare medicală","Recuperare neuro-psiho-motorie","Recuperare pediatrică","Recuperare medicină fizică şi balneologie","Reumatologie","Tbc. osteoarticular"]
[23,24,25,26,27,28,29,30,31,32,33,34,35,36,37,38,39,40,41,42,43,44,45,46]
[0,0,0,0,0,0,0,0,0,0,0,0,0,0,0,0,0,0,0,0,0,0,0,0]
[0,0,0,0,0,0,0,0,0,0,0,0,0,0,0,0,0,0,0,0,0,0,0,0]
[]
[]
[]
[]
[]
["Toxicologie","Urologie","Alte","COVID","COVID COPII","Genetică Medicală"]
[47,48,49,50,51,52]
[0,0,0,0,0,0]
[0,0,0,0,0,0]

{"sheet":"c15","index":3,"n_rows":259,"n_cols":124,"rows_kept":259,"cut":false,"hidden":false,"merged":[[255,0,255,1],[256,0,256,1],[257,0,257,1],[258,0,258,1],[249,0,249,1],[250,0,250,1],[251,0,251,1],[252,0,252,1],[253,0,253,1],[254,0,254,1],[243,0,243,1],[244,0,244,1],[245,0,245,1],[246,0,246,1],[247,0,247,1],[248,0,248,1],[237,0,237,1],[238,0,238,1],[239,0,239,1],[240,0,240,1],[241,0,241,1],[242,0,242,1],[231,0,231,1],[232,0,232,1],[233,0,233,1],[234,0,234,1],[235,0,235,1],[236,0,236,1],[225,0,225,1],[226,0,226,1],[227,0,227,1],[228,0,228,1],[229,0,229,1],[230,0,230,1],[219,0,219,1],[220,0,220,1],[221,0,221,1],[222,0,222,1],[223,0,223,1],[224,0,224,1],[213,0,213,1],[214,0,214,1],[215,0,215,1],[216,0,216,1],[217,0,217,1],[218,0,218,1],[209,0,209,1],[210,0,210,1],[211,0,211,1],[212,0,212,1],[201,0,201,1],[202,0,202,1],[203,0,203,1],[204,0,204,1],[205,0,205,1],[206,0,206,1],[200,0,200,1],[189,0,189,1],[190,0,190,1],[191,0,191,1],[192,0,192,1],[193,0,193,1],[194,0,194,1],[207,0,207,1],[208,0,208,1],[195,0,195,1],[196,0,196,1],[197,0,197,1],[198,0,198,1],[199,0,199,1],[185,19,185,20],[185,21,186,21],[185,22,185,23],[183,2,186,2],[183,3,183,5],[184,18,184,20],[184,21,184,23],[184,24,184,26],[184,27,184,29],[185,6,186,6],[184,3,186,3],[184,4,186,4],[184,5,186,5],[185,18,186,18],[187,0,187,1],[188,0,188,1],[185,15,186,15],[185,16,185,17],[185,24,186,24],[185,25,185,26],[185,27,186,27],[185,28,185,29],[172,0,172,1],[173,0,173,1],[174,0,174,1],[175,0,175,1],[176,0,176,1],[183,0,186,1],[185,7,185,8],[185,9,186,9],[185,10,185,11],[185,12,186,12],[185,13,185,14],[184,6,184,8],[184,9,184,11],[184,12,184,14],[184,15,184,17],[183,24,183,29],[166,0,166,1],[167,0,167,1],[168,0,168,1],[169,0,169,1],[170,0,170,1],[171,0,171,1],[160,0,160,1],[161,0,161,1],[162,0,162,1],[163,0,163,1],[164,0,164,1],[165,0,165,1],[154,0,154,1],[155,0,155,1],[156,0,156,1],[157,0,157,1],[158,0,158,1],[159,0,159,1],[148,0,148,1],[149,0,149,1],[150,0,150,1],[151,0,151,1],[152,0,152,1],[153,0,153,1],[142,0,142,1],[143,0,143,1],[144,0,144,1],[145,0,145,1],[146,0,146,1],[147,0,147,1],[136,0,136,1],[137,0,137,1],[138,0,138,1],[139,0,139,1],[140,0,140,1],[141,0,141,1],[130,0,130,1],[131,0,131,1],[132,0,132,1],[133,0,133,1],[134,0,134,1],[135,0,135,1],[124,0,124,1],[125,0,125,1],[126,0,126,1],[127,0,127,1],[128,0,128,1],[129,0,129,1],[118,0,118,1],[119,0,119,1],[120,0,120,1],[121,0,121,1],[122,0,122,1],[123,0,123,1],[112,0,112,1],[113,0,113,1],[114,0,114,1],[115,0,115,1],[116,0,116,1],[117,0,117,1],[106,0,106,1],[107,0,107,1],[108,0,108,1],[109,0,109,1],[110,0,110,1],[111,0,111,1],[104,13,104,14],[104,15,105,15],[104,16,104,17],[103,9,105,9],[103,10,103,11],[103,12,105,12],[104,10,104,11],[103,13,103,14],[103,15,103,17],[104,7,104,8],[56,21,56,23],[56,24,56,26],[103,18,103,20],[103,21,103,23],[103,24,103,26],[95,0,95,1],[96,0,96,1],[102,0,105,1],[102,2,105,2],[102,3,102,5],[102,6,102,11],[103,3,105,3],[103,4,105,4],[103,5,105,5],[103,6,105,6],[103,7,103,8],[102,12,102,113],[103,57,103,59],[103,60,103,62],[103,63,103,65],[103,69,103,71],[57,28,57,29],[59,0,59,1],[60,0,60,1],[61,0,61,1],[62,0,62,1],[63,0,79,0],[57,19,57,20],[57,21,58,21],[57,22,57,23],[57,24,58,24],[57,25,57,26],[57,27,58,27],[80,0,80,1],[81,0,81,1],[82,0,85,0],[86,0,92,0],[93,0,93,1],[94,0,94,1],[103,45,103,47],[49,0,49,1],[49,115,49,116],[55,0,58,1],[55,2,58,2],[55,3,55,5],[55,24,55,29],[56,3,58,3],[56,4,58,4],[56,5,58,5],[56,6,56,8],[56,27,56,29],[57,6,58,6],[57,7,57,8],[57,9,58,9],[57,10,57,11],[57,12,58,12],[57,13,57,14],[57,15,58,15],[57,16,57,17],[57,18,58,18],[56,9,56,11],[56,12,56,14],[56,15,56,17],[56,18,56,20],[46,0,46,1],[46,115,46,116],[47,0,47,1],[47,115,47,116],[48,0,48,1],[48,115,48,116],[34,0,34,1],[34,115,34,116],[35,0,38,0],[35,115,38,115],[39,0,45,0],[39,115,45,115],[10,39,11,39],[10,40,10,41],[15,0,15,1],[15,115,15,116],[16,0,32,0],[16,115,32,115],[33,0,33,1],[33,115,33,116],[12,0,12,1],[12,115,12,116],[13,0,13,1],[13,115,13,116],[14,0,14,1],[14,115,14,116],[10,30,11,30],[10,31,10,32],[10,33,11,33],[10,34,10,35],[10,18,11,18],[10,19,10,20],[10,21,11,21],[10,22,10,23],[10,24,11,24],[10,25,10,26],[9,45,9,47],[9,48,9,50],[9,119,11,119],[9,120,11,120],[10,6,11,6],[10,7,10,8],[10,9,11,9],[10,10,10,11],[10,12,11,12],[10,13,10,14],[10,15,11,15],[10,16,10,17],[9,87,9,89],[9,90,9,92],[9,93,9,95],[9,115,11,116],[9,117,11,117],[9,118,11,118],[9,69,9,71],[9,72,9,74],[9,75,9,77],[9,78,9,80],[10,27,11,27],[10,28,10,29],[8,0,11,1],[8,2,11,2],[8,3,8,5],[9,3,11,3],[9,4,11,4],[9,5,11,5],[9,6,9,8],[9,9,9,11],[9,12,9,14],[8,6,8,104],[9,36,9,38],[10,36,11,36],[10,37,10,38],[9,51,9,53],[9,54,9,56],[9,57,9,59],[9,60,9,62],[9,63,9,65],[9,66,9,68],[9,81,9,83],[9,84,9,86],[9,96,9,98],[9,99,9,101],[9,102,9,104],[9,15,9,17],[9,18,9,20],[9,21,9,23],[9,24,9,26],[9,27,9,29],[9,30,9,32],[9,33,9,35],[9,39,9,41],[9,42,9,44],[103,72,103,74],[103,75,103,77],[103,78,103,80],[103,81,103,83],[103,102,103,104],[103,105,103,107],[103,108,103,110],[103,111,103,113],[103,27,103,29],[103,84,103,86],[103,87,103,89],[103,90,103,92],[103,93,103,95],[103,96,103,98],[103,99,103,101],[103,66,103,68],[103,30,103,32],[103,33,103,35],[103,36,103,38],[103,39,103,41],[103,42,103,44],[103,48,103,50],[103,51,103,53],[103,54,103,56]]}
[]
[]
[]
[]
[]
["MS.60.4.4A"]
["Cap.15. PERSONAL MEDIU SANITAR, PERSONAL AUXILIAR SANITAR, MUNCITORI, PERSONAL DE SERVIRE ŞI PERSONAL DIN APARATUL FUNCŢIONAL PE CATEGORII DE UNITĂŢI",null,null,null,null,null,null,null,null,null,null,null,null,null,null,null,null,null,null,null,null,null,null,null,null,null,null,null,null,null,null,null,null,null,null,null,null,null,null,null,null,null,null,null,null,null,null,null,null,null,null,null,null,null,null,null,null,null,null,null,null,null,null,null,null,null,null,null,null,null,null,null,null,null,null,null,null,null,null,null,null,null,null,null,null,null,null,null,null,null,null,null,null,null,null,null,null,null,null,null,null,null,null,null,null,null,null,null,null,null,null,null,null,null,null,"verificare intre tabelele A si B"]
["A"]
["CATEGORII DE PERSONAL",null,"Randul","TOTAL",null,null,"            Repartizarea personalului sanitar mediu şi auxiliar pe tipuri de unităţi"]
[null,null,null,"TOTAL","MASCULIN","FEMININ","spital",null,null,"Centru de sănătate cu paturi de spital",null,null,"Sanatorii TBC",null,null,"Preventorii",null,null,"Sanatorii balneare",null,null,"Dispensare medicale",null,null,"Cabinete medicale şcolare",null,null,"Cabinete medicale  studenţeşti",null,null,"Cabinete med.  de medicină generală ",null,null,"Cabinete medicale de familie",null,null,"Societati civile medicale",null,null,"Farmacii",null,null,"Puncte farmaceutice",null,null,"Depozite farmaceutice",null,null,"Policlinici",null,null,"Centre de diag. şi tratatament",null,null,"Centre medicale de specialitate",null,null,"Ambulatorii de specialitate",null,null,"Ambulatorii integrate spitalului",null,null,"Cabinete stomatologice",null,null,"Societati stomatologice civile medicale",null,null,"Cabinete medicale de specialitate",null,null,"Societati civile medicale de specialitate",null,null,"Centre de sănătate",null,null,"Centre de sănătate mintală",null,null,"C.T.S.",null,null,"Laboratoare medicale",null,null,"Laboratoare de tehnică dentară",null,null,"Institute, unităţi cercet. fără paturi",null,null,"MS, DSP, INSP",null,null,"Sanatorii nevroze/ neuropsihiatrie",null,null,"Salvare",null,null,"Alte tipuri de unităţi",null,null,null,null,null,null,null,null,null,null,null,null,"CATEGORII DE PERSONAL",null,"Randul","TOTAL","MASCULIN","FEMININ"]
[null,null,null,null,null,null,"Total","din care:",null,"Total","din care:",null,"Total","din care:",null,"Total","din care:",null,"Total","din care:",null,"Total","din care:",null,"Total","din care:",null,"Total","din care:",null,"Total","din care:",null,"Total","din care:",null,"Total","din care:",null,"Total","din care:",null,"Total","din care:",null,"Total","din care:",null,"Total","din care:",null,"Total","din care:",null,"Total","din care:",null,"Total","din care:",null,"Total","din care:",null,"Total","din care:",null,"Total","din care:",null,"Total","din care:",null,"Total","din care:",null,"Total","din care:",null,"Total","din care:",null,"Total","din care:",null,"Total","din care:",null,"Total","din care:",null,"Total","din care:",null,"Total","din care:",null,"Total","din care:",null,"Total","din care:",null,"Total","din care:"]
[null,null,null,null,null,null,null,"masculin","feminin",null,"masculin","feminin",null,"masculin","feminin",null,"masculin","feminin",null,"masculin","feminin",null,"masculin","feminin",null,"masculin","feminin",null,"masculin","feminin",null,"masculin","feminin",null,"masculin","feminin",null,"masculin","feminin",null,"masculin","feminin",null,"masculin","feminin",null,"masculin","feminin",null,"masculin","feminin",null,"masculin","feminin",null,"masculin","feminin",null,"masculin","feminin",null,"masculin","feminin",null,"masculin","feminin",null,"masculin","feminin",null,"masculin","feminin",null,"masculin","feminin",null,"masculin","feminin",null,"masculin","feminin",null,"masculin","feminin",null,"masculin","feminin",null,"masculin","feminin",null,"masculin","feminin",null,"masculin","feminin",null,"masculin","feminin",null,"masculin","feminin",null,"masculin","feminin"]
["A",null,"B",1,2,3,4,5,6,7,8,9,10,11,12,13,14,15,16,17,18,19,20,21,22,23,24,25,26,27,28,29,30,31,32,33,31,32,33,34,35,36,37,38,39,40,41,42,43,44,45,46,47,48,49,50,51,52,53,54,55,56,57,58,59,60,58,59,60,61,62,63,61,62,63,64,65,66,67,68,69,70,71,72,73,74,75,76,77,78,79,80,81,82,83,84,85,86,87,88,89,90,91,92,93,null,null,null,null,null,null,null,null,null,null,"A",null,"B",1,2,3]
["TOTAL PERSONAL (rând  2+34+35+36+37)",null,1,{"$f":"+D15+SUM(D47:D50)","v":0},0,0,0,0,0,{"$f":"+J15+SUM(J47:J50)","v":0},0,0,0,0,0,0,0,0,0,0,0,0,0,0,0,0,0,0,0,0,0,0,0,0,0,0,{"$f":"+AK15+SUM(AK47:AK50)","v":0},0,0,{"$f":"+AN15+SUM(AN47:AN50)","v":0},{"$f":"+AO15+SUM(AO47:AO50)","v":0},0,0,0,0,0,0,0,0,0,0,0,0,0,0,0,0,0,0,0,0,0,0,0,0,0,{"$f":"+BO15+SUM(BO47:BO50)","v":0},0,0,{"$f":"+BR15+SUM(BR47:BR50)","v":0},0,0,0,0,0,0,0,0,0,0,0,0,0,0,0,0,0,0,0,0,0,0,0,0,0,0,0,0,0,0,0,0,0,0,0,null,null,null,null,null,null,null,null,null,null,"TOTAL PERSONAL (rând 02+34+35+36+37)",null,1,{"$f":"+D61-D14","v":0},0,0]
["TOTAL PERSONAL MEDIU SANITAR        (rândurile   3; 21 – 33)",null,2,{"$f":"+D16+SUM(D34:D46)","v":0},0,0,0,0,0,0,0,0,0,0,0,0,0,0,0,0,0,0,0,0,0,0,0,0,0,0,0,0,0,0,0,0,{"$f":"+AK16+SUM(AK34:AK46)","v":0},0,0,{"$f":"+AN16+SUM(AN34:AN46)","v":0},0,0,0,0,0,0,0,0,0,0,0,0,0,0,0,0,0,0,0,0,0,0,0,0,0,0,0,0,0,0,0,0,0,0,0,0,{"$f":"+BY16+SUM(BY34:BY46)","v":0},0,0,0,0,0,0,0,0,0,0,0,0,0,0,0,0,0,0,0,0,0,0,0,0,0,0,0,0,null,null,null,null,null,null,null,null,null,null,"TOTAL PERSONAL MEDIU SANITAR        (rândurile 03; 21 – 33)",null,2,0,0,0]
["Asistenţi, surori –  TOTAL   (rând  4 – 20)",null,3,{"$f":"SUM(D17:D33)-D28","v":0},0,0,0,0,0,{"$f":"SUM(J17:J33)-J28","v":0},0,0,0,0,0,0,0,0,0,0,0,0,0,0,{"$f":"SUM(Y17:Y33)-Y28","v":0},0,0,0,0,0,0,0,0,0,0,0,{"$f":"SUM(AK17:AK33)-AK28","v":0},0,0,{"$f":"SUM(AN17:AN33)-AN28","v":0},0,0,0,0,0,0,0,0,0,0,0,0,0,0,0,0,0,0,0,0,0,0,0,0,0,0,0,0,0,0,0,{"$f":"SUM(BT17:BT33)-BT28","v":0},0,0,0,0,0,0,0,0,0,0,0,0,0,0,0,0,0,0,0,0,0,0,0,0,0,{"$f":"SUM(CT17:CT33)-CT28","v":0},0,0,0,0,0,0,0,null,null,null,null,null,null,null,null,null,null,"Asistenţi, surori –  TOTAL         (rând 04 – 20)",null,3,0,0,0]
["După specialitate","Medicale",4,{"$f":"+E17+F17","v":0},{"$f":"+H17+K17+N17+Q17+T17+W17+Z17+AC17+AF17+AI17+AL17+AO17+AR17+AU17+AX17+BA17+BD17+BG17+BJ17+BM17+BP17+BS17+BV17+BY17+CB17+CE17+CH17+CK17+CN17+CQ17+CT17+CW17+CZ17","v":0},{"$f":"+I17+L17+O17+R17+U17+X17+AA17+AD17+AG17+AJ17+AM17+AP17+AS17+AV17+AY17+BB17+BE17+BH17+BK17+BN17+BQ17+BT17+BW17+BZ17+CC17+CF17+CI17+CL17+CO17+CR17+CU17+CX17+DA17","v":0},0,{"$f":"+G17-I17","v":0},0,0,{"$f":"+J17-L17","v":0},0,0,{"$f":"+M17-O17","v":0},0,0,{"$f":"+P17-R17","v":0},0,0,{"$f":"+S17-U17","v":0},0,0,{"$f":"+V17-X17","v":0},0,0,{"$f":"+Y17-AA17","v":0},0,0,{"$f":"+AB17-AD17","v":0},0,0,{"$f":"+AE17-AG17","v":0},0,0,{"$f":"+AH17-AJ17","v":0},0,0,{"$f":"+AK17-AM17","v":0},0,0,{"$f":"+AN17-AP17","v":0},0,0,{"$f":"+AQ17-AS17","v":0},0,0,{"$f":"+AT17-AV17","v":0},0,0,{"$f":"+AW17-AY17","v":0},0,0,{"$f":"+AZ17-BB17","v":0},0,0,{"$f":"+BC17-BE17","v":0},0,0,{"$f":"+BF17-BH17","v":0},0,0,{"$f":"+BI17-BK17","v":0},0,0,{"$f":"+BL17-BN17","v":0},0,0,{"$f":"+BO17-BQ17","v":0},0,0,{"$f":"+BR17-BT17","v":0},0,0,{"$f":"+BU17-BW17","v":0},0,0,{"$f":"+BX17-BZ17","v":0},0,0,{"$f":"+CA17-CC17","v":0},0,0,{"$f":"+CD17-CF17","v":0},0,0,{"$f":"+CG17-CI17","v":0},0,0,{"$f":"+CJ17-CL17","v":0},0,0,{"$f":"+CM17-CO17","v":0},0,0,{"$f":"+CP17-CR17","v":0},0,0,{"$f":"+CS17-CU17","v":0},0,0,{"$f":"+CV17-CX17","v":0},0,0,{"$f":"+CY17-DA17","v":0},0,null,null,null,null,null,null,null,null,null,null,"După specialitate","Medicale",4,0,0,0]
[null,"Pediatrie",5,{"$f":"+E18+F18","v":0},{"$f":"+H18+K18+N18+Q18+T18+W18+Z18+AC18+AF18+AI18+AL18+AO18+AR18+AU18+AX18+BA18+BD18+BG18+BJ18+BM18+BP18+BS18+BV18+BY18+CB18+CE18+CH18+CK18+CN18+CQ18+CT18+CW18+CZ18","v":0},{"$f":"+I18+L18+O18+R18+U18+X18+AA18+AD18+AG18+AJ18+AM18+AP18+AS18+AV18+AY18+BB18+BE18+BH18+BK18+BN18+BQ18+BT18+BW18+BZ18+CC18+CF18+CI18+CL18+CO18+CR18+CU18+CX18+DA18","v":0},0,{"$f":"+G18-I18","v":0},0,0,{"$f":"+J18-L18","v":0},0,0,{"$f":"+M18-O18","v":0},0,0,{"$f":"+P18-R18","v":0},0,0,{"$f":"+S18-U18","v":0},0,0,{"$f":"+V18-X18","v":0},0,0,{"$f":"+Y18-AA18","v":0},0,0,{"$f":"+AB18-AD18","v":0},0,0,{"$f":"+AE18-AG18","v":0},0,0,{"$f":"+AH18-AJ18","v":0},0,0,{"$f":"+AK18-AM18","v":0},0,0,{"$f":"+AN18-AP18","v":0},0,0,{"$f":"+AQ18-AS18","v":0},0,0,{"$f":"+AT18-AV18","v":0},0,0,{"$f":"+AW18-AY18","v":0},0,0,{"$f":"+AZ18-BB18","v":0},0,0,{"$f":"+BC18-BE18","v":0},0,0,{"$f":"+BF18-BH18","v":0},0,0,{"$f":"+BI18-BK18","v":0},0,0,{"$f":"+BL18-BN18","v":0},0,0,{"$f":"+BO18-BQ18","v":0},0,0,{"$f":"+BR18-BT18","v":0},0,0,{"$f":"+BU18-BW18","v":0},0,0,{"$f":"+BX18-BZ18","v":0},0,0,{"$f":"+CA18-CC18","v":0},0,0,{"$f":"+CD18-CF18","v":0},0,0,{"$f":"+CG18-CI18","v":0},0,0,{"$f":"+CJ18-CL18","v":0},0,0,{"$f":"+CM18-CO18","v":0},0,0,{"$f":"+CP18-CR18","v":0},0,0,{"$f":"+CS18-CU18","v":0},0,0,{"$f":"+CV18-CX18","v":0},0,0,{"$f":"+CY18-DA18","v":0},0,null,null,null,null,null,null,null,null,null,null,null,"Pediatrie",5,0,0,0]
[null,"Obstetrică-ginecologie (moaşe)",6,0,0,0,0,0,0,0,0,0,0,0,0,0,0,0,0,0,0,0,0,0,0,0,0,0,0,0,0,0,0,0,0,0,0,0,0,0,0,0,0,0,0,0,0,0,0,0,0,0,0,0,0,0,0,0,0,0,0,0,0,0,0,0,0,0,0,0,0,0,0,0,0,0,0,0,0,0,0,0,0,0,0,0,0,0,0,0,0,0,0,0,0,0,0,0,0,0,0,0,0,0,0,null,null,null,null,null,null,null,null,null,null,null,"Obstetrică-ginecologie (moaşe)",6,0,0,0]
[null,"Igienă",7,0,0,0,0,0,0,0,0,0,0,0,0,0,{"$f":"+P2-R2","v":0},0,0,{"$f":"+S2-U2","v":0},0,0,0,0,0,0,0,0,0,0,0,0,0,0,0,0,0,0,0,0,0,0,0,0,0,0,0,0,0,0,0,0,0,0,0,0,0,0,0,0,0,0,0,0,0,0,0,0,0,0,0,0,0,0,0,0,0,0,0,0,0,0,0,0,0,0,0,0,0,0,0,0,0,0,0,0,0,0,0,0,0,0,0,0,0,null,null,null,null,null,null,null,null,null,null,null,"Igienă",7,0,0,0]
[null,"Radiologie",8,0,0,0,0,0,0,0,0,0,0,0,0,0,0,0,0,0,0,0,0,0,0,0,0,0,0,0,0,0,0,0,0,0,0,0,0,0,0,0,0,0,0,0,0,0,0,0,0,0,0,0,0,0,0,0,0,0,0,0,0,0,0,0,0,0,0,0,0,0,0,0,0,0,0,0,0,0,0,0,0,0,0,0,0,0,0,0,0,0,0,0,0,0,0,0,0,0,0,0,0,0,0,null,null,null,null,null,null,null,null,null,null,null,"Radiologie",8,0,0,0]
[null,"Balneofizioterapie şi recuperare medicală",9,0,0,0,0,0,0,0,0,0,0,0,0,0,0,0,0,0,0,0,0,0,0,0,0,0,0,0,0,0,0,0,0,0,0,0,0,0,0,0,0,0,0,0,0,0,0,0,0,0,0,0,0,0,0,0,0,0,0,0,0,0,0,0,0,0,0,0,0,0,0,0,0,0,0,0,0,0,0,0,0,0,0,0,0,0,0,0,0,0,0,0,0,0,0,0,0,0,0,0,0,0,0,null,null,null,null,null,null,null,null,null,null,null,"Balneofizioterapie şi recuperare medicală",9,0,0,0]
[null,"Dietetică",10,0,0,0,0,0,0,0,0,0,0,0,0,0,0,0,0,0,0,0,0,0,0,0,0,0,0,0,0,0,0,0,0,0,0,0,0,0,0,0,0,0,0,0,0,0,0,0,0,0,0,0,0,0,0,0,0,0,0,0,0,0,0,0,0,0,0,0,0,0,0,0,0,0,0,0,0,0,0,0,0,0,0,0,0,0,0,0,0,0,0,0,0,0,0,0,0,0,0,0,0,0,0,null,null,null,null,null,null,null,null,null,null,null,"Dietetică",10,0,0,0]
[null,"Nutriţie şi diabet",11,0,0,0,0,0,0,0,0,0,0,0,0,0,0,0,0,0,0,0,0,0,0,0,0,0,0,0,0,0,0,0,0,0,0,0,0,0,0,0,0,0,0,0,0,0,0,0,0,0,0,0,0,0,0,0,0,0,0,0,0,0,0,0,0,0,0,0,0,0,0,0,0,0,0,0,0,0,0,0,0,0,0,0,0,0,0,0,0,0,0,0,0,0,0,0,0,0,0,0,0,0,0,null,null,null,null,null,null,null,null,null,null,null,"Nutriţie şi diabet",11,0,0,0]
[null,"Stomatologie",12,0,0,0,0,0,0,0,0,0,0,0,0,0,0,0,0,0,0,0,0,0,0,0,0,0,0,0,0,0,0,0,0,0,0,0,0,0,0,0,0,0,0,0,0,0,0,0,0,0,0,0,0,0,0,0,0,0,0,0,0,0,0,0,0,0,0,0,0,0,0,0,0,0,0,0,0,0,0,0,0,0,0,0,0,0,0,0,0,0,0,0,0,0,0,0,0,0,0,0,0,0,0,null,null,null,null,null,null,null,null,null,null,null,"Stomatologie",12,0,0,0]
[null,"Urgenţe medico- chirurgicale",13,0,0,0,0,0,0,0,0,0,0,0,0,0,0,0,0,0,0,0,0,0,0,0,0,0,0,0,0,0,0,0,0,0,0,0,0,0,0,0,0,0,0,0,0,0,0,0,0,0,0,0,0,0,0,0,0,0,0,0,0,0,0,0,0,0,0,0,0,0,0,0,0,0,0,0,0,0,0,0,0,0,0,0,0,0,0,0,0,0,0,0,0,0,0,0,0,0,0,0,0,0,0,null,null,null,null,null,null,null,null,null,null,null,"Urgenţe medico- chirurgicale",13,0,0,0]
[null,"Fiziokinetoterapeuţi, din care:",14,0,0,0,0,0,0,0,0,0,0,0,0,0,0,0,0,0,0,0,0,0,0,0,0,0,0,0,0,0,0,0,0,0,0,0,0,0,0,0,0,0,0,0,0,0,0,0,0,0,0,0,0,0,0,0,0,0,0,0,0,0,0,0,0,0,0,0,0,0,0,0,0,0,0,0,0,0,0,0,0,0,0,0,0,0,0,0,0,0,0,0,0,0,0,0,0,0,0,0,0,0,0,null,null,null,null,null,null,null,null,null,null,null,"Fiziokinetoterapeuţi, din care:",14,0,0,0]
[null,"                                           - fizioterapeuţi",15,0,0,0,0,0,0,0,0,0,0,0,0,0,0,0,0,0,0,0,0,0,0,0,0,0,0,0,0,0,0,0,0,0,0,0,0,0,0,0,0,0,0,0,0,0,0,0,0,0,0,0,0,0,0,0,0,0,0,0,0,0,0,0,0,0,0,0,0,0,0,0,0,0,0,0,0,0,0,0,0,0,0,0,0,0,0,0,0,0,0,0,0,0,0,0,0,0,0,0,0,0,0,null,null,null,null,null,null,null,null,null,null,null,"                                           - fizioterapeuţi",15,0,0,0]
[null,"Ocrotire",16,0,0,0,0,0,0,0,0,0,0,0,0,0,0,0,0,0,0,0,0,0,0,0,0,0,0,0,0,0,0,0,0,0,0,0,0,0,0,0,0,0,0,0,0,0,0,0,0,0,0,0,0,0,0,0,0,0,0,0,0,0,0,0,0,0,0,0,0,0,0,0,0,0,0,0,0,0,0,0,0,0,0,0,0,0,0,0,0,0,0,0,0,0,0,0,0,0,0,0,0,0,0,null,null,null,null,null,null,null,null,null,null,null,"Ocrotire",16,0,0,0]
[null,"Laborator biologie clinică",17,0,0,0,0,0,0,0,0,0,0,0,0,0,{"$f":"+P3-R3","v":0},0,0,{"$f":"+S3-U3","v":0},0,0,0,0,0,0,0,0,0,0,0,0,0,0,0,0,0,0,0,0,0,0,0,0,0,0,0,0,0,0,0,0,0,0,0,0,0,0,0,0,0,0,0,0,0,0,0,0,0,0,0,0,0,0,0,0,0,0,0,0,0,0,0,0,0,0,0,0,0,0,0,0,0,0,0,0,0,0,0,0,0,0,0,0,0,null,null,null,null,null,null,null,null,null,null,null,"Laborator biologie clinică",17,0,0,0]
[null,"Laborator anatomie patologică",18,0,0,0,0,0,0,0,0,0,0,0,0,0,0,0,0,0,0,0,0,0,0,0,0,0,0,0,0,0,0,0,0,0,0,0,0,0,0,0,0,0,0,0,0,0,0,0,0,0,0,0,0,0,0,0,0,0,0,0,0,0,0,0,0,0,0,0,0,0,0,0,0,0,0,0,0,0,0,0,0,0,0,0,0,0,0,0,0,0,0,0,0,0,0,0,0,0,0,0,0,0,0,null,null,null,null,null,null,null,null,null,null,null,"Laborator anatomie patologică",18,0,0,0]
[null,"Farmacie",19,0,0,0,0,0,0,0,0,0,0,0,0,0,0,0,0,0,0,0,0,0,0,0,0,0,0,0,0,0,0,0,0,0,0,0,0,0,0,0,0,0,0,0,0,0,0,0,0,0,0,0,0,0,0,0,0,0,0,0,0,0,0,0,0,0,0,0,0,0,0,0,0,0,0,0,0,0,0,0,0,0,0,0,0,0,0,0,0,0,0,0,0,0,0,0,0,0,0,0,0,0,0,null,null,null,null,null,null,null,null,null,null,null,"Farmacie",19,0,0,0]
[null,"Alţi asistenţi",20,0,0,0,0,0,0,0,0,0,0,0,0,0,0,0,0,0,0,0,0,0,0,0,0,0,0,0,0,0,0,0,0,0,0,0,0,0,0,0,0,0,0,0,0,0,0,0,0,0,0,0,0,0,0,0,0,0,0,0,0,0,0,0,0,0,0,0,0,0,0,0,0,0,0,0,0,0,0,0,0,0,0,0,0,0,0,0,0,0,0,0,0,0,0,0,0,0,0,0,0,0,0,null,null,null,null,null,null,null,null,null,null,null,"Alţi asistenţi",20,0,0,0]
["   Registratori medicali",null,21,0,0,0,0,0,0,0,0,0,0,0,0,0,0,0,0,0,0,0,0,0,0,0,0,0,0,0,0,0,0,0,0,0,0,0,0,0,0,0,0,0,0,0,0,0,0,0,0,0,0,0,0,0,0,0,0,0,0,0,0,0,0,0,0,0,0,0,0,0,0,0,0,0,0,0,0,0,0,0,0,0,0,0,0,0,0,0,0,0,0,0,0,0,0,0,0,0,0,0,0,0,0,null,null,null,null,null,null,null,null,null,null,"   Registratori medicali",null,21,0,0,0]
["   Statisticieni medicali",null,22,0,0,0,0,0,0,0,0,0,0,0,0,0,0,0,0,0,0,0,0,0,0,0,0,0,0,0,0,0,0,0,0,0,0,0,0,0,0,0,0,0,0,0,0,0,0,0,0,0,0,0,0,0,0,0,0,0,0,0,0,0,0,0,0,0,0,0,0,0,0,0,0,0,0,0,0,0,0,0,0,0,0,0,0,0,0,0,0,0,0,0,0,0,0,0,0,0,0,0,0,0,0,null,null,null,null,null,null,null,null,null,null,"   Statisticieni medicali",null,22,0,0,0]
["Tehnicieni","Dentari",23,0,0,0,0,0,0,0,0,0,0,0,0,0,0,0,0,0,0,0,0,0,0,0,0,0,0,0,0,0,0,0,0,0,0,0,0,0,0,0,0,0,0,0,0,0,0,0,0,0,0,0,0,0,0,0,0,0,0,0,0,0,0,0,0,0,0,0,0,0,0,0,0,0,0,0,0,0,0,0,0,0,0,0,0,0,0,0,0,0,0,0,0,0,0,0,0,0,0,0,0,0,0,null,null,null,null,null,null,null,null,null,null,"Tehnicieni","Dentari",23,0,0,0]
[null,"Opticieni",24,0,0,0,0,0,0,0,0,0,0,0,0,0,0,0,0,0,0,0,0,0,0,0,0,0,0,0,0,0,0,0,0,0,0,0,0,0,0,0,0,0,0,0,0,0,0,0,0,0,0,0,0,0,0,0,0,0,0,0,0,0,0,0,0,0,0,0,0,0,0,0,0,0,0,0,0,0,0,0,0,0,0,0,0,0,0,0,0,0,0,0,0,0,0,0,0,0,0,0,0,0,0,null,null,null,null,null,null,null,null,null,null,null,"Opticieni",24,0,0,0]
[null,"Utilaje medicale",25,0,0,0,0,0,0,0,0,0,0,0,0,0,0,0,0,0,0,0,0,0,0,0,0,0,0,0,0,0,0,0,0,0,0,0,0,0,0,0,0,0,0,0,0,0,0,0,0,0,0,0,0,0,0,0,0,0,0,0,0,0,0,0,0,0,0,0,0,0,0,0,0,0,0,0,0,0,0,0,0,0,0,0,0,0,0,0,0,0,0,0,0,0,0,0,0,0,0,0,0,0,0,null,null,null,null,null,null,null,null,null,null,null,"Utilaje medicale",25,0,0,0]
[null,"Protezare",26,0,0,0,0,0,0,0,0,0,0,0,0,0,0,0,0,0,0,0,0,0,0,0,0,0,0,0,0,0,0,0,0,0,0,0,0,0,0,0,0,0,0,0,0,0,0,0,0,0,0,0,0,0,0,0,0,0,0,0,0,0,0,0,0,0,0,0,0,0,0,0,0,0,0,0,0,0,0,0,0,0,0,0,0,0,0,0,0,0,0,0,0,0,0,0,0,0,0,0,0,0,0,null,null,null,null,null,null,null,null,null,null,null,"Protezare",26,0,0,0]
["Alte","Droghişti",27,0,0,0,0,0,0,0,0,0,0,0,0,0,{"$f":"+P4-R4","v":0},0,0,{"$f":"+S4-U4","v":0},0,0,0,0,0,0,0,0,0,0,0,0,0,0,0,0,0,0,0,0,0,0,0,0,0,0,0,0,0,0,0,0,0,0,0,0,0,0,0,0,0,0,0,0,0,0,0,0,0,0,0,0,0,0,0,0,0,0,0,0,0,0,0,0,0,0,0,0,0,0,0,0,0,0,0,0,0,0,0,0,0,0,0,0,0,null,null,null,null,null,null,null,null,null,null,"Alte","Droghişti",27,0,0,0]
[null,"Gipsari",28,0,0,0,0,0,0,0,0,0,0,0,0,0,0,0,0,0,0,0,0,0,0,0,0,0,0,0,0,0,0,0,0,0,0,0,0,0,0,0,0,0,0,0,0,0,0,0,0,0,0,0,0,0,0,0,0,0,0,0,0,0,0,0,0,0,0,0,0,0,0,0,0,0,0,0,0,0,0,0,0,0,0,0,0,0,0,0,0,0,0,0,0,0,0,0,0,0,0,0,0,0,0,null,null,null,null,null,null,null,null,null,null,null,"Gipsari",28,0,0,0]
[null,"Maseuri",29,0,0,0,0,0,0,0,0,0,0,0,0,0,0,0,0,0,0,0,0,0,0,0,0,0,0,0,0,0,0,0,0,0,0,0,0,0,0,0,0,0,0,0,0,0,0,0,0,0,0,0,0,0,0,0,0,0,0,0,0,0,0,0,0,0,0,0,0,0,0,0,0,0,0,0,0,0,0,0,0,0,0,0,0,0,0,0,0,0,0,0,0,0,0,0,0,0,0,0,0,0,0,null,null,null,null,null,null,null,null,null,null,null,"Maseuri",29,0,0,0]
[null,"Autopsieri",30,0,0,0,0,0,0,0,0,0,0,0,0,0,0,0,0,0,0,0,0,0,0,0,0,0,0,0,0,0,0,0,0,0,0,0,0,0,0,0,0,0,0,0,0,0,0,0,0,0,0,0,0,0,0,0,0,0,0,0,0,0,0,0,0,0,0,0,0,0,0,0,0,0,0,0,0,0,0,0,0,0,0,0,0,0,0,0,0,0,0,0,0,0,0,0,0,0,0,0,0,0,0,null,null,null,null,null,null,null,null,null,null,null,"Autopsieri",30,0,0,0]
[null,"Instructori c.f.m.",31,0,0,0,0,0,0,0,0,0,0,0,0,0,0,0,0,0,0,0,0,0,0,0,0,0,0,0,0,0,0,0,0,0,0,0,0,0,0,0,0,0,0,0,0,0,0,0,0,0,0,0,0,0,0,0,0,0,0,0,0,0,0,0,0,0,0,0,0,0,0,0,0,0,0,0,0,0,0,0,0,0,0,0,0,0,0,0,0,0,0,0,0,0,0,0,0,0,0,0,0,0,0,null,null,null,null,null,null,null,null,null,null,null,"Instructori c.f.m.",31,0,0,0]
[null,"Instructori educaţie",32,0,0,0,0,0,0,0,0,0,0,0,0,0,0,0,0,0,0,0,0,0,0,0,0,0,0,0,0,0,0,0,0,0,0,0,0,0,0,0,0,0,0,0,0,0,0,0,0,0,0,0,0,0,0,0,0,0,0,0,0,0,0,0,0,0,0,0,0,0,0,0,0,0,0,0,0,0,0,0,0,0,0,0,0,0,0,0,0,0,0,0,0,0,0,0,0,0,0,0,0,0,0,null,null,null,null,null,null,null,null,null,null,null,"Instructori educaţie",32,0,0,0]
[null,"Dentişti (studii medii)",33,0,0,0,0,0,0,0,0,0,0,0,0,0,0,0,0,0,0,0,0,0,0,0,0,0,0,0,0,0,0,0,0,0,0,0,0,0,0,0,0,0,0,0,0,0,0,0,0,0,0,0,0,0,0,0,0,0,0,0,0,0,0,0,0,0,0,0,0,0,0,0,0,0,0,0,0,0,0,0,0,0,0,0,0,0,0,0,0,0,0,0,0,0,0,0,0,0,0,0,0,0,0,null,null,null,null,null,null,null,null,null,null,null,"Dentişti (studii medii)",33,0,0,0]
[" TOTAL PERSONAL AUXILIAR SANITAR",null,34,0,0,0,0,0,0,0,0,0,0,0,0,0,0,0,0,0,0,0,0,0,0,0,0,0,0,0,0,0,0,0,0,0,0,0,0,0,0,0,0,0,0,0,0,0,0,0,0,0,0,0,0,0,0,0,0,0,0,0,0,0,0,0,0,0,0,0,0,0,0,0,0,0,0,0,0,0,0,0,0,0,0,0,0,0,0,0,0,0,0,0,0,0,0,0,0,0,0,0,0,0,0,null,null,null,null,null,null,null,null,null,null," TOTAL PERSONAL AUXILIAR SANITAR",null,34,0,0,0]
["MUNCITORI",null,35,0,0,0,0,0,0,0,0,0,0,0,0,0,0,0,0,0,0,0,0,0,0,0,0,0,0,0,0,0,0,0,0,0,0,0,0,0,0,0,0,0,0,0,0,0,0,0,0,0,0,0,0,0,0,0,0,0,0,0,0,0,0,0,0,0,0,0,0,0,0,0,0,0,0,0,0,0,0,0,0,0,0,0,0,0,0,0,0,0,0,0,0,0,0,0,0,0,0,0,0,0,0,null,null,null,null,null,null,null,null,null,null,"     MUNCITORI",null,35,0,0,0]
["PERSONAL DE SERVIRE",null,36,0,0,0,0,0,0,0,0,0,0,0,0,0,0,0,0,0,0,0,0,0,0,0,0,0,0,0,0,0,0,0,0,0,0,0,0,0,0,0,0,0,0,0,0,0,0,0,0,0,0,0,0,0,0,0,0,0,0,0,0,0,0,0,0,0,0,0,0,0,0,0,0,0,0,0,0,0,0,0,0,0,0,0,0,0,0,0,0,0,0,0,0,0,0,0,0,0,0,0,0,0,0,null,null,null,null,null,null,null,null,null,null,"     PERSONAL DE SERVIRE",null,36,0,0,0]
["PERSONAL DIN APARAT FUNCŢIONAL",null,37,0,0,0,0,0,0,0,0,0,0,0,0,0,{"$f":"+P5-R5","v":0},0,0,{"$f":"+S5-U5","v":0},0,0,0,0,0,0,0,0,0,0,0,0,0,0,0,0,0,0,0,0,0,0,0,0,0,0,0,0,0,0,0,0,0,0,0,0,0,0,0,0,0,0,0,0,0,0,0,0,0,0,0,0,0,0,0,0,0,0,0,0,0,0,0,0,0,0,0,0,0,0,0,0,0,0,0,0,0,0,0,0,0,0,0,0,0,null,null,null,null,null,null,null,null,null,null,"PERSONAL DIN APARAT FUNCŢIONAL",null,37,0,0,0]
[]
[]
[]
["Cap.15. PERSONAL MEDIU SANITAR, PERSONAL AUXILIAR SANITAR, MUNCITORI, PERSONAL DE SERVIRE ŞI PERSONAL DIN APARATUL FUNCŢIONAL PE GRUPE DE VÂRSTĂ"]
["B"]
["CATEGORII DE PERSONAL",null,"Randul","TOTAL",null,null,"            Repartizarea personalului sanitar mediu şi auxiliar pe grupe de vârstă",null,null,null,null,null,null,null,null,null,null,null,null,null,null,null,null,null,"Cu normă întreagă"]
[null,null,null,"TOTAL","MASCULIN","FEMININ","Sub 25 ani",null,null,"25-34 ani",null,null,"35-44 ani",null,null,"45-54 ani",null,null,"55-64 ani",null,null,"65 ani şi peste",null,null,"Total",null,null,"din care: in spital, centru de sanatate cu paturi, san. TBC, preventorii, san. de nevroze/neuropsihiatrie, san. balneare"]
[null,null,null,null,null,null,"Total","din care:",null,"Total","din care:",null,"Total","din care:",null,"Total","din care:",null,"Total","din care:",null,"Total","din care:",null,"Total","din care:",null,"Total","din care:"]
[null,null,null,null,null,null,null,"masculin","feminin",null,"masculin","feminin",null,"masculin","feminin",null,"masculin","feminin",null,"masculin","feminin",null,"masculin","feminin",null,"masculin","feminin",null,"masculin","feminin"]
["A",null,"B",1,2,3,4,5,6,7,8,9,10,11,12,13,14,15,16,17,18,19,20,21,22,23,24,25,26,27]
["TOTAL PERSONA  (rând  2+34+35+36+37)",null,1,{"$f":"+D62+SUM(D94:D97)","v":0},{"$f":"+E62+SUM(E94:E97)","v":0},0,0,0,0,{"$f":"+J62+SUM(J94:J97)","v":0},{"$f":"+K62+SUM(K94:K97)","v":0},{"$f":"+L62+SUM(L94:L97)","v":0},0,0,0,0,0,0,0,0,0,0,0,0,0,0,0,0,0,0]
["TOTAL PERSONAL MEDIU SANITAR        (rândurile  3; 21 – 33)",null,2,{"$f":"+D63+SUM(D81:D93)","v":0},0,0,0,0,0,0,0,0,0,0,0,0,0,0,0,0,0,0,0,0,0,0,0,0,0,0]
["Asistenţi, surori –  TOTAL        (rând  4 – 20)",null,3,{"$f":"SUM(D64:D80)-D75","v":0},{"$f":"SUM(E64:E80)-E75","v":0},0,0,0,0,{"$f":"SUM(J64:J80)-J75","v":0},{"$f":"SUM(K64:K80)-K75","v":0},{"$f":"SUM(L64:L80)-L75","v":0},0,0,0,0,0,0,0,0,0,0,0,0,0,0,0,0,0,0]
["După specialitate","Medicale",4,{"$f":"+E64+F64","v":0},{"$f":"+H64+K64+N64+Q64+T64+W64","v":0},{"$f":"+I64+L64+O64+R64+U64+X64","v":0},0,{"$f":"+G64-I64","v":0},0,0,{"$f":"+J64-L64","v":0},0,0,{"$f":"+M64-O64","v":0},0,0,{"$f":"+P64-R64","v":0},0,0,{"$f":"+S64-U64","v":0},0,0,{"$f":"+V64-X64","v":0},0,0,{"$f":"+Y64-AA64","v":0},0,0,{"$f":"+AB64-AD64","v":0},0,{"$f":"IF((E64>=Z64),\"OK\",\"Err\")","v":"OK"},"OK",{"$f":"IF((Z64>=AC64),\"OK\",\"Err\")","v":"OK"},"OK"]
[null,"Pediatrie",5,{"$f":"+E65+F65","v":0},{"$f":"+H65+K65+N65+Q65+T65+W65","v":0},0,0,{"$f":"+G65-I65","v":0},0,0,{"$f":"+J65-L65","v":0},0,0,{"$f":"+M65-O65","v":0},0,0,{"$f":"+P65-R65","v":0},0,0,{"$f":"+S65-U65","v":0},0,0,{"$f":"+V65-X65","v":0},0,0,{"$f":"+Y65-AA65","v":0},0,0,{"$f":"+AB65-AD65","v":0},0,"OK","OK","OK","OK"]
[null,"Obstetrică-ginecologie (moaşe)",6,0,0,0,0,0,0,0,0,0,0,0,0,0,0,0,0,0,0,0,0,0,0,0,0,0,0,0,"OK","OK","OK","OK"]
[null,"Igienă",7,0,0,0,0,0,0,0,0,0,0,0,0,0,0,0,0,0,0,0,0,0,0,0,0,0,0,0,"OK","OK","OK","OK"]
[null,"Radiologie",8,0,0,0,0,0,0,0,0,0,0,0,0,0,0,0,0,0,0,0,0,0,0,0,0,0,0,0,"OK","OK","OK","OK"]
[null,"Balneofizioterapie şi recuperare medicală",9,0,0,0,0,0,0,0,0,0,0,0,0,0,0,0,0,0,0,0,0,0,0,0,0,0,0,0,"OK","OK","OK","OK"]
[null,"Dietetică",10,0,0,0,0,0,0,0,0,0,0,0,0,0,0,0,0,0,0,0,0,0,0,0,0,0,0,0,"OK","OK","OK","OK"]
[null,"Nutriţie şi diabet",11,0,0,0,0,0,0,0,0,0,0,0,0,0,0,0,0,0,0,0,0,0,0,0,0,0,0,0,"OK","OK","OK","OK"]
[null,"Stomatologie",12,0,0,0,0,0,0,0,0,0,0,0,0,0,0,0,0,0,0,0,0,0,0,0,0,0,0,0,"OK","OK","OK","OK"]
[null,"Urgenţe medico- chirurgicale",13,0,0,0,0,0,0,0,0,0,0,0,0,0,0,0,0,0,0,0,0,0,0,0,0,0,0,0,"OK","OK","OK","OK"]
[null,"Fiziokinetoterapeuţi, din care:",14,0,0,0,0,0,0,0,0,0,0,0,0,0,0,0,0,0,0,0,0,0,0,0,0,0,0,0,"OK","OK","OK","OK"]
[null,"                                           - fizioterapeuţi",15,0,0,0,0,0,0,0,0,0,0,0,0,0,0,0,0,0,0,0,0,0,0,0,0,0,0,0,"OK","OK","OK","OK"]
[null,"Ocrotire",16,0,0,0,0,0,0,0,0,0,0,0,0,0,0,0,0,0,0,0,0,0,0,0,0,0,0,0,"OK","OK","OK","OK"]
[null,"Laborator biologie clinică",17,0,0,0,0,0,0,0,0,0,0,0,0,0,0,0,0,0,0,0,0,0,0,0,0,0,0,0,"OK","OK","OK","OK"]
[null,"Laborator anatomie patologică",18,0,0,0,0,0,0,0,0,0,0,0,0,0,0,0,0,0,0,0,0,0,0,0,0,0,0,0,"OK","OK","OK","OK"]
[null,"Farmacie",19,0,0,0,0,0,0,0,0,0,0,0,0,0,0,0,0,0,0,0,0,0,0,0,0,0,0,0,"OK","OK","OK","OK"]
[null,"Alţi asistenţi",20,0,0,0,0,0,0,0,0,0,0,0,0,0,0,0,0,0,0,0,0,0,0,0,0,0,0,0,"OK","OK","OK","OK"]
["   Registratori medicali",null,21,0,0,0,0,0,0,0,0,0,0,0,0,0,0,0,0,0,0,0,0,0,0,0,0,0,0,0,"OK","OK","OK","OK"]
["   Statisticieni medicali",null,22,0,0,0,0,0,0,0,0,0,0,0,0,0,0,0,0,0,0,0,0,0,0,0,0,0,0,0,"OK","OK","OK","OK"]
["Tehnicieni","Dentari",23,0,0,0,0,0,0,0,0,0,0,0,0,0,0,0,0,0,0,0,0,0,0,0,0,0,0,0,"OK","OK","OK","OK"]
[null,"Opticieni",24,0,0,0,0,0,0,0,0,0,0,0,0,0,0,0,0,0,0,0,0,0,0,0,0,0,0,0,"OK","OK","OK","OK"]
[null,"Utilaje medicale",25,0,0,0,0,0,0,0,0,0,0,0,0,0,0,0,0,0,0,0,0,0,0,0,0,0,0,0,"OK","OK","OK","OK"]
[null,"Protezare",26,0,0,0,0,0,0,0,0,0,0,0,0,0,0,0,0,0,0,0,0,0,0,0,0,0,0,0,"OK","OK","OK","OK"]
["Alte","Droghişti",27,0,0,0,0,0,0,0,0,0,0,0,0,0,0,0,0,0,0,0,0,0,0,0,0,0,0,0,"OK","OK","OK","OK"]
[null,"Gipsari",28,0,0,0,0,0,0,0,0,0,0,0,0,0,0,0,0,0,0,0,0,0,0,0,0,0,0,0,"OK","OK","OK","OK"]
[null,"Maseuri",29,0,0,0,0,0,0,0,0,0,0,0,0,0,0,0,0,0,0,0,0,0,0,0,0,0,0,0,"OK","OK","OK","OK"]
[null,"Autopsieri",30,0,0,0,0,0,0,0,0,0,0,0,0,0,0,0,0,0,0,0,0,0,0,0,0,0,0,0,"OK","OK","OK","OK"]
[null,"Instructori c.f.m.",31,0,0,0,0,0,0,0,0,0,0,0,0,0,0,0,0,0,0,0,0,0,0,0,0,0,0,0,"OK","OK","OK","OK"]
[null,"Instructori educaţie",32,0,0,0,0,0,0,0,0,0,0,0,0,0,0,0,0,0,0,0,0,0,0,0,0,0,0,0,"OK","OK","OK","OK"]
[null,"Dentişti (studii medii)",33,0,0,0,0,0,0,0,0,0,0,0,0,0,0,0,0,0,0,0,0,0,0,0,0,0,0,0,"OK","OK","OK","OK"]
[" TOTAL PERSONAL AUXILIAR SANITAR",null,34,0,0,0,0,0,0,0,0,0,0,0,0,0,0,0,0,0,0,0,0,0,0,0,0,0,0,0,"OK","OK","OK","OK"]
["MUNCITORI",null,35,0,0,0,0,0,0,0,0,0,0,0,0,0,0,0,0,0,0,0,0,0,0,0,0,0,0,0,"OK","OK","OK","OK"]
["PERSONAL DE SERVIRE",null,36,0,0,0,0,0,0,0,0,0,0,0,0,0,0,0,0,0,0,0,0,0,0,0,0,0,0,0,"OK","OK","OK","OK"]
["PERSONAL DIN APARAT FUNCŢIONAL",null,37,0,0,0,0,0,0,0,0,0,0,0,0,0,0,0,0,0,0,0,0,0,0,0,0,0,0,0,"OK","OK","OK","OK"]
[]
[]
[]
["Cap.15. PERSONAL SANITAR CU STUDII SUPERIOARE PE CATEGORII DE UNITĂŢI",null,null,null,null,null,{"$f":"IF(I110=(F191),\"OK\",\"Err\")","v":"OK"},{"$f":"IF(I165=(F247),\"OK\",\"Err\")","v":"OK"},{"$f":"IF(I169=(F251),\"OK\",\"Err\")","v":"OK"},null,null,null,null,null,null,null,null,null,null,null,null,null,null,null,null,null,null,null,null,null,null,null,null,null,null,null,null,null,null,null,null,null,null,null,null,null,null,null,null,null,null,null,null,null,null,null,null,null,null,null,null,null,null,null,null,null,null,null,null,null,null,null,null,null,null,null,null,null,null,null,null,null,null,null,null,null,null,null,null,null,null,null,null,null,null,null,null,null,null,null,null,null,null,null,null,null,null,null,null,null,null,null,null,null,null,null,null,null,"verificare intre tabelele C si D"]
["C",null,null,null,null,null,{"$f":"IF(G110=(D191),\"OK\",\"Err\")","v":"OK"},{"$f":"IF(G165=(D247),\"OK\",\"Err\")","v":"OK"},{"$f":"IF(G169=(D251),\"OK\",\"Err\")","v":"OK"}]
["CATEGORII DE PERSONAL",null,"Randul","TOTAL",null,null,"din care:",null,null,null,null,null,"            Repartizarea personalului sanitar cu studii superioare pe tipuri de unităţi",null,null,null,null,null,null,null,null,null,null,null,null,null,null,null,null,null,null,null,null,null,null,null,null,null,null,null,null,null,null,null,null,null,null,null,null,null,null,null,null,null,null,null,null,null,null,null,null,null,null,null,null,null,null,null,null,null,null,null,null,null,null,null,null,null,null,null,null,null,null,null,null,null,null,null,null,null,null,null,null,null,null,null,null,null,null,null,null,null,null,null,null,null,null,null,null,null,null,null,null,null,"UMF*)",null,null,null,"CATEGORII DE PERSONAL",null,"Randul"]
[null,null,null,"TOTAL","MASCULIN","FEMININ","Total rezi-denţi","REZIDENŢI",null,"Total  MEDICI PT.COPII","din care: MEDICI PENTRU COPII",null,"Total venit din alta tara","venit din alta tara",null,"spital",null,null,"Centru de sănătate cu paturi de spital",null,null,"Sanatorii TBC",null,null,"Preventorii",null,null,"Sanatorii balneare",null,null,"Dispensare medicale",null,null,"Cabinete medicale şcolare",null,null,"Cabinete medicale  studenţeşti",null,null,"Cabinete med.  de medicină generală ",null,null,"Cabinete medicale de familie",null,null,"Societati civile medicale",null,null,"Farmacii",null,null,"Puncte farmaceutice",null,null,"Depozite farmaceutice",null,null,"Policlinici",null,null,"Centre de diag. şi tratatament",null,null,"Centre medicale de specialitate",null,null,"Ambulatorii de specialitate",null,null,"Ambulatorii integrate spitalului",null,null,"Cabinete stomatologice",null,null,"Societati stomatologice civile medicale",null,null,"Cabinete medicale de specialitate",null,null,"Societati civile medicale de specialitate",null,null,"Centre de sănătate",null,null,"Centre de sănătate mintală",null,null,"C.T.S.",null,null,"Laboratoare medicale",null,null,"Laboratoare de tehnică dentară",null,null,"Institute, unităţi cercet. fără paturi",null,null,"MS, DSP",null,null,"Sanatorii nevroze/ neuropsihiatrie",null,null,"Salvare",null,null,"Alte tipuri de unităţi",null,null,null,null,null,null,null,null,null,"TOTAL","MASCULIN","FEMININ"]
[null,null,null,null,null,null,null,"TOTAL",null,null,"TOTAL",null,null,"din care:",null,"Total","din care:",null,"Total","din care:",null,"Total","din care:",null,"Total","din care:",null,"Total","din care:",null,"Total","din care:",null,"Total","din care:",null,"Total","din care:",null,"Total","din care:",null,"Total","din care:",null,"Total","din care:",null,"Total","din care:",null,"Total","din care:",null,"Total","din care:",null,"Total","din care:",null,"Total","din care:",null,"Total","din care:",null,"Total","din care:",null,"Total","din care:",null,"Total","din care:",null,"Total","din care:",null,"Total","din care:",null,"Total","din care:",null,"Total","din care:",null,"Total","din care:",null,"Total","din care:",null,"Total","din care:",null,"Total","din care:",null,"Total","din care:",null,"Total","din care:",null,"Total","din care:",null,"Total","din care:",null,"Total","din care:"]
[null,null,null,null,null,null,null,"masculin","feminin",null,"masculin","feminin",null,"masculin","feminin",null,"masculin","feminin",null,"masculin","feminin",null,"masculin","feminin",null,"masculin","feminin",null,"masculin","feminin",null,"masculin","feminin",null,"masculin","feminin",null,"masculin","feminin",null,"masculin","feminin",null,"masculin","feminin",null,"masculin","feminin",null,"masculin","feminin",null,"masculin","feminin",null,"masculin","feminin",null,"masculin","feminin",null,"masculin","feminin",null,"masculin","feminin",null,"masculin","feminin",null,"masculin","feminin",null,"masculin","feminin",null,"masculin","feminin",null,"masculin","feminin",null,"masculin","feminin",null,"masculin","feminin",null,"masculin","feminin",null,"masculin","feminin",null,"masculin","feminin",null,"masculin","feminin",null,"masculin","feminin",null,"masculin","feminin",null,"masculin","feminin",null,"masculin","feminin",null,"masculin","feminin"]
["A",null,"B",1,2,3,4,5,6,7,8,9,10,11,12,13,14,15,16,17,18,19,20,21,22,23,24,25,26,27,28,29,30,31,32,33,34,35,36,37,38,39,40,41,42,40,41,42,43,44,45,46,47,48,49,50,51,52,53,54,55,56,57,58,59,60,61,62,63,64,65,66,67,68,69,67,68,69,70,71,72,70,71,72,73,74,75,76,77,78,79,80,81,82,83,84,85,86,87,88,89,90,91,92,93,94,95,96,97,98,99,100,101,102,103,null,null,null,"A",null,"B",1,2,3]
["TOTAL PERSONAL CU STUDII SUPERIOARE (rândurile  2+57+61+65+67+69+70)",null,1,{"$f":"+E108+F108","v":0},{"$f":"+E109+E164+E168+E172+E174+E176+E177","v":0},{"$f":"+F109+F164+F168+F172+F174+F176+F177","v":0},{"$f":"+G109+G164+G168","v":0},{"$f":"+H109+H164+H168","v":0},{"$f":"+I109+I164+I168","v":0},{"$f":"+J109+J164+J168+J172+J174+J176+J177","v":0},0,0,0,0,0,0,0,0,0,0,0,0,0,0,0,0,0,0,0,0,0,0,0,0,0,0,0,0,0,0,0,0,0,0,0,{"$f":"+AT109+AT164+AT168+AT172+AT174+AT176+AT177","v":0},0,0,{"$f":"+AW109+AW164+AW168+AW172+AW174+AW176+AW177","v":0},0,0,0,0,0,0,0,0,0,0,0,0,0,0,0,0,0,0,0,0,0,0,0,0,0,0,0,0,0,0,{"$f":"+CB109+CB164+CB168+CB172+CB174+CB176+CB177","v":0},0,{"$f":"+CD109+CD164+CD168+CD172+CD174+CD176+CD177","v":0},{"$f":"+CE109+CE164+CE168+CE172+CE174+CE176+CE177","v":0},0,{"$f":"+CG109+CG164+CG168+CG172+CG174+CG176+CG177","v":0},0,0,0,0,0,0,0,0,0,0,0,0,0,0,0,0,0,0,0,0,0,0,0,0,0,0,0,0,0,0,null,null,null,"TOTAL PERSONAL CU STUDII SUPERIOARE (rândurile 02+57+61+65+67+69+70)",null,1,{"$f":"+D189-D108","v":0},0,0]
["I. MEDICI (EXCLUSIV DENTIŞTI) – TOTAL     (rândurile  4+......+56),                   din care:",null,2,{"$f":"SUM(D111:D163)","v":0},{"$f":"SUM(E111:E163)","v":0},0,0,0,0,0,0,0,0,0,0,0,0,0,0,0,0,0,0,0,0,0,0,0,0,0,0,0,0,0,0,0,0,0,0,0,0,0,0,0,0,{"$f":"SUM(AT111:AT163)","v":0},0,0,{"$f":"SUM(AW111:AW163)","v":0},0,0,0,0,0,0,0,0,0,0,0,0,0,0,0,0,0,0,0,0,0,0,{"$f":"SUM(BT111:BT163)","v":0},0,0,0,{"$f":"SUM(BX111:BX163)","v":0},0,0,{"$f":"SUM(CA111:CA163)","v":0},0,0,0,0,0,0,0,0,0,0,0,0,0,0,0,0,0,0,0,0,0,0,0,0,0,0,0,0,0,0,0,0,0,0,0,0,null,null,null,"I. MEDICI (EXCLUSIV DENTIŞTI) – TOTAL     (rândurile 04+......+56)                   din care:",null,2,0,0,0]
["                    - rezidenţi ",null,3,{"$f":"+E110+F110","v":0},{"$f":"+Q110+T110+W110+Z110+AC110+AF110+AI110+AL110+AO110+AR110+AU110+AX110+BA110+BD110+BG110+BJ110+BM110+BP110+BS110+BV110+BY110+CB110+CE110+CH110+CK110+CN110+CQ110+CT110+CW110+CZ110+DC110+DF110+DI110","v":0},{"$f":"R110+U110+X110+AA110+AD110+AG110+AJ110+AM110+AP110+AS110+AV110+AY110+BB110+BE110+BH110+BK110+BN110+BQ110+BT110+BW110+BZ110+CC110+CF110+CI110+CL110+CO110+CR110+CU110+CX110+DA110+DD110+DG110+DJ110","v":0},0,{"$f":"+G110-I110","v":0},0,0,{"$f":"+J110-L110","v":0},0,0,{"$f":"+M110-O110","v":0},0,0,{"$f":"+P110-R110","v":0},0,0,{"$f":"+S110-U110","v":0},0,0,{"$f":"+V110-X110","v":0},0,0,{"$f":"+Y110-AA110","v":0},0,0,{"$f":"+AB110-AD110","v":0},0,0,{"$f":"+AE110-AG110","v":0},0,0,{"$f":"+AH110-AJ110","v":0},0,0,{"$f":"+AK110-AM110","v":0},0,0,{"$f":"+AN110-AP110","v":0},0,0,{"$f":"+AQ110-AS110","v":0},0,0,{"$f":"+AT110-AV110","v":0},0,0,{"$f":"+AW110-AY110","v":0},0,0,{"$f":"+AZ110-BB110","v":0},0,0,{"$f":"+BC110-BE110","v":0},0,0,{"$f":"+BF110-BH110","v":0},0,0,{"$f":"+BI110-BK110","v":0},0,0,{"$f":"+BL110-BN110","v":0},0,0,{"$f":"+BO110-BQ110","v":0},0,0,{"$f":"+BR110-BT110","v":0},0,0,{"$f":"+BU110-BW110","v":0},0,0,{"$f":"+BX110-BZ110","v":0},0,0,{"$f":"+CA110-CC110","v":0},0,0,{"$f":"+CD110-CF110","v":0},0,0,{"$f":"+CG110-CI110","v":0},0,0,{"$f":"+CJ110-CL110","v":0},0,0,{"$f":"+CM110-CO110","v":0},0,0,{"$f":"+CP110-CR110","v":0},0,0,{"$f":"+CS110-CU110","v":0},0,0,{"$f":"+CV110-CX110","v":0},0,0,{"$f":"+CY110-DA110","v":0},0,0,{"$f":"+DB110-DD110","v":0},0,0,{"$f":"+DE110-DG110","v":0},0,0,{"$f":"+DH110-DJ110","v":0},0,0,null,null,null,"                    - rezidenţi ",null,3,0,0,0]
["1. Alergologie şi imunologie clinică",null,4,{"$f":"+E111+F111","v":0},{"$f":"+Q111+T111+W111+Z111+AC111+AF111+AI111+AL111+AO111+AR111+AU111+AX111+BA111+BD111+BG111+BJ111+BM111+BP111+BS111+BV111+BY111+CB111+CE111+CH111+CK111+CN111+CQ111+CT111+CW111+CZ111+DC111+DF111+DI111","v":0},{"$f":"R111+U111+X111+AA111+AD111+AG111+AJ111+AM111+AP111+AS111+AV111+AY111+BB111+BE111+BH111+BK111+BN111+BQ111+BT111+BW111+BZ111+CC111+CF111+CI111+CL111+CO111+CR111+CU111+CX111+DA111+DD111+DG111+DJ111","v":0},0,{"$f":"+G111-I111","v":0},0,0,{"$f":"+J111-L111","v":0},0,0,{"$f":"+M111-O111","v":0},0,0,{"$f":"+P111-R111","v":0},0,0,{"$f":"+S111-U111","v":0},0,0,{"$f":"+V111-X111","v":0},0,0,{"$f":"+Y111-AA111","v":0},0,0,{"$f":"+AB111-AD111","v":0},0,0,{"$f":"+AE111-AG111","v":0},0,0,{"$f":"+AH111-AJ111","v":0},0,0,{"$f":"+AK111-AM111","v":0},0,0,{"$f":"+AN111-AP111","v":0},0,0,{"$f":"+AQ111-AS111","v":0},0,0,{"$f":"+AT111-AV111","v":0},0,0,{"$f":"+AW111-AY111","v":0},0,0,{"$f":"+AZ111-BB111","v":0},0,0,{"$f":"+BC111-BE111","v":0},0,0,{"$f":"+BF111-BH111","v":0},0,0,{"$f":"+BI111-BK111","v":0},0,0,{"$f":"+BL111-BN111","v":0},0,0,{"$f":"+BO111-BQ111","v":0},0,0,{"$f":"+BR111-BT111","v":0},0,0,{"$f":"+BU111-BW111","v":0},0,0,{"$f":"+BX111-BZ111","v":0},0,0,{"$f":"+CA111-CC111","v":0},0,0,{"$f":"+CD111-CF111","v":0},0,0,{"$f":"+CG111-CI111","v":0},0,0,{"$f":"+CJ111-CL111","v":0},0,0,{"$f":"+CM111-CO111","v":0},0,0,{"$f":"+CP111-CR111","v":0},0,0,{"$f":"+CS111-CU111","v":0},0,0,{"$f":"+CV111-CX111","v":0},0,0,{"$f":"+CY111-DA111","v":0},0,0,{"$f":"+DB111-DD111","v":0},0,0,{"$f":"+DE111-DG111","v":0},0,0,{"$f":"+DH111-DJ111","v":0},0,0,null,null,null,"1. Alergologie şi imunologie clinică",null,4,0,0,0]
["2. A.T.I.",null,5,0,0,0,0,0,0,0,{"$f":"+J112-L112","v":0},0,0,0,0,0,{"$f":"+P112-R112","v":0},0,0,{"$f":"+S112-U112","v":0},0,0,{"$f":"+V112-X112","v":0},0,0,{"$f":"+Y112-AA112","v":0},0,0,{"$f":"+AB112-AD112","v":0},0,0,{"$f":"+AE112-AG112","v":0},0,0,{"$f":"+AH112-AJ112","v":0},0,0,{"$f":"+AK112-AM112","v":0},0,0,{"$f":"+AN112-AP112","v":0},0,0,{"$f":"+AQ112-AS112","v":0},0,0,{"$f":"+AT112-AV112","v":0},0,0,{"$f":"+AW112-AY112","v":0},0,0,{"$f":"+AZ112-BB112","v":0},0,0,{"$f":"+BC112-BE112","v":0},0,0,{"$f":"+BF112-BH112","v":0},0,0,{"$f":"+BI112-BK112","v":0},0,0,{"$f":"+BL112-BN112","v":0},0,0,{"$f":"+BO112-BQ112","v":0},0,0,{"$f":"+BR112-BT112","v":0},0,0,{"$f":"+BU112-BW112","v":0},0,0,{"$f":"+BX112-BZ112","v":0},0,0,{"$f":"+CA112-CC112","v":0},0,0,{"$f":"+CD112-CF112","v":0},0,0,{"$f":"+CG112-CI112","v":0},0,0,{"$f":"+CJ112-CL112","v":0},0,0,{"$f":"+CM112-CO112","v":0},0,0,{"$f":"+CP112-CR112","v":0},0,0,{"$f":"+CS112-CU112","v":0},0,0,{"$f":"+CV112-CX112","v":0},0,0,{"$f":"+CY112-DA112","v":0},0,0,{"$f":"+DB112-DD112","v":0},0,0,{"$f":"+DE112-DG112","v":0},0,0,{"$f":"+DH112-DJ112","v":0},0,0,null,null,null,"2. A.T.I.",null,5,0,0,0]
["3. Boli infecţioase",null,6,0,0,0,0,0,0,0,0,0,0,0,0,0,{"$f":"+P113-R113","v":0},0,0,{"$f":"+S113-U113","v":0},0,0,{"$f":"+V113-X113","v":0},0,0,{"$f":"+Y113-AA113","v":0},0,0,{"$f":"+AB113-AD113","v":0},0,0,{"$f":"+AE113-AG113","v":0},0,0,{"$f":"+AH113-AJ113","v":0},0,0,{"$f":"+AK113-AM113","v":0},0,0,{"$f":"+AN113-AP113","v":0},0,0,{"$f":"+AQ113-AS113","v":0},0,0,{"$f":"+AT113-AV113","v":0},0,0,{"$f":"+AW113-AY113","v":0},0,0,{"$f":"+AZ113-BB113","v":0},0,0,{"$f":"+BC113-BE113","v":0},0,0,{"$f":"+BF113-BH113","v":0},0,0,{"$f":"+BI113-BK113","v":0},0,0,{"$f":"+BL113-BN113","v":0},0,0,{"$f":"+BO113-BQ113","v":0},0,0,{"$f":"+BR113-BT113","v":0},0,0,{"$f":"+BU113-BW113","v":0},0,0,{"$f":"+BX113-BZ113","v":0},0,0,{"$f":"+CA113-CC113","v":0},0,0,{"$f":"+CD113-CF113","v":0},0,0,{"$f":"+CG113-CI113","v":0},0,0,{"$f":"+CJ113-CL113","v":0},0,0,{"$f":"+CM113-CO113","v":0},0,0,{"$f":"+CP113-CR113","v":0},0,0,{"$f":"+CS113-CU113","v":0},0,0,{"$f":"+CV113-CX113","v":0},0,0,{"$f":"+CY113-DA113","v":0},0,0,{"$f":"+DB113-DD113","v":0},0,0,{"$f":"+DE113-DG113","v":0},0,0,{"$f":"+DH113-DJ113","v":0},0,0,null,null,null,"3. Boli infecţioase",null,6,0,0,0]
["4. Cardiologie",null,7,0,0,0,0,0,0,0,0,0,0,0,0,0,{"$f":"+P114-R114","v":0},0,0,{"$f":"+S114-U114","v":0},0,0,{"$f":"+V114-X114","v":0},0,0,{"$f":"+Y114-AA114","v":0},0,0,{"$f":"+AB114-AD114","v":0},0,0,{"$f":"+AE114-AG114","v":0},0,0,{"$f":"+AH114-AJ114","v":0},0,0,{"$f":"+AK114-AM114","v":0},0,0,{"$f":"+AN114-AP114","v":0},0,0,{"$f":"+AQ114-AS114","v":0},0,0,{"$f":"+AT114-AV114","v":0},0,0,{"$f":"+AW114-AY114","v":0},0,0,{"$f":"+AZ114-BB114","v":0},0,0,{"$f":"+BC114-BE114","v":0},0,0,{"$f":"+BF114-BH114","v":0},0,0,{"$f":"+BI114-BK114","v":0},0,0,{"$f":"+BL114-BN114","v":0},0,0,{"$f":"+BO114-BQ114","v":0},0,0,{"$f":"+BR114-BT114","v":0},0,0,{"$f":"+BU114-BW114","v":0},0,0,{"$f":"+BX114-BZ114","v":0},0,0,{"$f":"+CA114-CC114","v":0},0,0,{"$f":"+CD114-CF114","v":0},0,0,{"$f":"+CG114-CI114","v":0},0,0,{"$f":"+CJ114-CL114","v":0},0,0,{"$f":"+CM114-CO114","v":0},0,0,{"$f":"+CP114-CR114","v":0},0,0,{"$f":"+CS114-CU114","v":0},0,0,{"$f":"+CV114-CX114","v":0},0,0,{"$f":"+CY114-DA114","v":0},0,0,{"$f":"+DB114-DD114","v":0},0,0,{"$f":"+DE114-DG114","v":0},0,0,{"$f":"+DH114-DJ114","v":0},0,0,null,null,null,"4. Cardiologie",null,7,0,0,0]
["5. Dermatovenerologie",null,8,0,0,0,0,0,0,0,0,0,0,0,0,0,0,0,0,0,0,0,0,0,0,0,0,0,0,0,0,0,0,0,0,0,0,0,0,0,0,0,0,0,0,0,0,0,0,0,0,0,0,0,0,0,0,0,0,0,0,0,0,0,0,0,0,0,0,0,0,0,0,0,0,0,0,0,0,0,0,0,0,0,0,0,0,0,0,0,0,0,0,0,0,0,0,0,0,0,0,0,0,0,0,0,0,0,0,0,0,0,0,0,0,null,null,null,"5. Dermatovenerologie",null,8,0,0,0]
["6. Diabet zaharat, nutriţie şi boli metabolice",null,9,0,0,0,0,0,0,0,0,0,0,0,0,0,0,0,0,0,0,0,0,0,0,0,0,0,0,0,0,0,0,0,0,0,0,0,0,0,0,0,0,0,0,0,0,0,0,0,0,0,0,0,0,0,0,0,0,0,0,0,0,0,0,0,0,0,0,0,0,0,0,0,0,0,0,0,0,0,0,0,0,0,0,0,0,0,0,0,0,0,0,0,0,0,0,0,0,0,0,0,0,0,0,0,0,0,0,0,0,0,0,0,0,null,null,null,"6. Diabet zaharat, nutriţie şi boli metabolice",null,9,0,0,0]
["7. Endocrinologie",null,10,0,0,0,0,0,0,0,0,0,0,0,0,0,0,0,0,0,0,0,0,0,0,0,0,0,0,0,0,0,0,0,0,0,0,0,0,0,0,0,0,0,0,0,0,0,0,0,0,0,0,0,0,0,0,0,0,0,0,0,0,0,0,0,0,0,0,0,0,0,0,0,0,0,0,0,0,0,0,0,0,0,0,0,0,0,0,0,0,0,0,0,0,0,0,0,0,0,0,0,0,0,0,0,0,0,0,0,0,0,0,0,0,null,null,null,"7. Endocrinologie",null,10,0,0,0]
["8. Expertiza medicală a capacităţii de muncă",null,11,0,0,0,0,0,0,0,0,0,0,0,0,0,0,0,0,0,0,0,0,0,0,0,0,0,0,0,0,0,0,0,0,0,0,0,0,0,0,0,0,0,0,0,0,0,0,0,0,0,0,0,0,0,0,0,0,0,0,0,0,0,0,0,0,0,0,0,0,0,0,0,0,0,0,0,0,0,0,0,0,0,0,0,0,0,0,0,0,0,0,0,0,0,0,0,0,0,0,0,0,0,0,0,0,0,0,0,0,0,0,0,0,null,null,null,"8. Expertiza medicală a capacităţii de muncă",null,11,0,0,0]
["9. Farmacologie clinică",null,12,0,0,0,0,0,0,0,0,0,0,0,0,0,0,0,0,0,0,0,0,0,0,0,0,0,0,0,0,0,0,0,0,0,0,0,0,0,0,0,0,0,0,0,0,0,0,0,0,0,0,0,0,0,0,0,0,0,0,0,0,0,0,0,0,0,0,0,0,0,0,0,0,0,0,0,0,0,0,0,0,0,0,0,0,0,0,0,0,0,0,0,0,0,0,0,0,0,0,0,0,0,0,0,0,0,0,0,0,0,0,0,0,null,null,null,"9. Farmacologie clinică",null,12,0,0,0]
["10. Gastroenterologie",null,13,0,0,0,0,0,0,0,0,0,0,0,0,0,0,0,0,0,0,0,0,0,0,0,0,0,0,0,0,0,0,0,0,0,0,0,0,0,0,0,0,0,0,0,0,0,0,0,0,0,0,0,0,0,0,0,0,0,0,0,0,0,0,0,0,0,0,0,0,0,0,0,0,0,0,0,0,0,0,0,0,0,0,0,0,0,0,0,0,0,0,0,0,0,0,0,0,0,0,0,0,0,0,0,0,0,0,0,0,0,0,0,0,null,null,null,"10. Gastroenterologie",null,13,0,0,0]
["11. Genetică medicală",null,14,0,0,0,0,0,0,0,0,0,0,0,0,0,0,0,0,0,0,0,0,0,0,0,0,0,0,0,0,0,0,0,0,0,0,0,0,0,0,0,0,0,0,0,0,0,0,0,0,0,0,0,0,0,0,0,0,0,0,0,0,0,0,0,0,0,0,0,0,0,0,0,0,0,0,0,0,0,0,0,0,0,0,0,0,0,0,0,0,0,0,0,0,0,0,0,0,0,0,0,0,0,0,0,0,0,0,0,0,0,0,0,0,null,null,null,"11. Genetică medicală",null,14,0,0,0]
["12. Geriatrie şi gerontologie",null,15,0,0,0,0,0,0,0,0,0,0,0,0,0,0,0,0,0,0,0,0,0,0,0,0,0,0,0,0,0,0,0,0,0,0,0,0,0,0,0,0,0,0,0,0,0,0,0,0,0,0,0,0,0,0,0,0,0,0,0,0,0,0,0,0,0,0,0,0,0,0,0,0,0,0,0,0,0,0,0,0,0,0,0,0,0,0,0,0,0,0,0,0,0,0,0,0,0,0,0,0,0,0,0,0,0,0,0,0,0,0,0,0,null,null,null,"12. Geriatrie şi gerontologie",null,15,0,0,0]
["13. Hematologie",null,16,0,0,0,0,0,0,0,0,0,0,0,0,0,0,0,0,0,0,0,0,0,0,0,0,0,0,0,0,0,0,0,0,0,0,0,0,0,0,0,0,0,0,0,0,0,0,0,0,0,0,0,0,0,0,0,0,0,0,0,0,0,0,0,0,0,0,0,0,0,0,0,0,0,0,0,0,0,0,0,0,0,0,0,0,0,0,0,0,0,0,0,0,0,0,0,0,0,0,0,0,0,0,0,0,0,0,0,0,0,0,0,0,null,null,null,"13. Hematologie",null,16,0,0,0]
["14. Medicină de familie",null,17,0,0,0,0,0,0,0,0,0,0,0,0,0,0,0,0,0,0,0,0,0,0,0,0,0,0,0,0,0,0,0,0,0,0,0,0,0,0,0,0,0,0,0,0,0,0,0,0,0,0,0,0,0,0,0,0,0,0,0,0,0,0,0,0,0,0,0,0,0,0,0,0,0,0,0,0,0,0,0,0,0,0,0,0,0,0,0,0,0,0,0,0,0,0,0,0,0,0,0,0,0,0,0,0,0,0,0,0,0,0,0,0,null,null,null,"14. Medicină de familie",null,17,{"$f":"+D205-D124","v":0},0,0]
["15. Medicină de urgenţă",null,18,0,0,0,0,0,0,0,0,0,0,0,0,0,0,0,0,0,0,0,0,0,0,0,0,0,0,0,0,0,0,0,0,0,0,0,0,0,0,0,0,0,0,0,0,0,0,0,0,0,0,0,0,0,0,0,0,0,0,0,0,0,0,0,0,0,0,0,0,0,0,0,0,0,0,0,0,0,0,0,0,0,0,0,0,0,0,0,0,0,0,0,0,0,0,0,0,0,0,0,0,0,0,0,0,0,0,0,0,0,0,0,0,null,null,null,"15. Medicină de urgenţă",null,18,0,0,0]
["16. Medicină internă",null,19,0,0,0,0,0,0,0,0,0,0,0,0,0,0,0,0,0,0,0,0,0,0,0,0,0,0,0,0,0,0,0,0,0,0,0,0,0,0,0,0,0,0,0,0,0,0,0,0,0,0,0,0,0,0,0,0,0,0,0,0,0,0,0,0,0,0,0,0,0,0,0,0,0,0,0,0,0,0,0,0,0,0,0,0,0,0,0,0,0,0,0,0,0,0,0,0,0,0,0,0,0,0,0,0,0,0,0,0,0,0,0,0,null,null,null,"16. Medicină internă",null,19,0,0,0]
["17. Medicină generală",null,20,0,0,0,0,0,0,0,0,0,0,0,0,0,0,0,0,0,0,0,0,0,0,0,0,0,0,0,0,0,0,0,0,0,0,0,0,0,0,0,0,0,0,0,0,0,0,0,0,0,0,0,0,0,0,0,0,0,0,0,0,0,0,0,0,0,0,0,0,0,0,0,0,0,0,0,0,0,0,0,0,0,0,0,0,0,0,0,0,0,0,0,0,0,0,0,0,0,0,0,0,0,0,0,0,0,0,0,0,0,0,0,0,null,null,null,"17. Medicină generală",null,20,0,0,0]
["18. Medicina muncii",null,21,0,0,0,0,0,0,0,0,0,0,0,0,0,0,0,0,0,0,0,0,0,0,0,0,0,0,0,0,0,0,0,0,0,0,0,0,0,0,0,0,0,0,0,0,0,0,0,0,0,0,0,0,0,0,0,0,0,0,0,0,0,0,0,0,0,0,0,0,0,0,0,0,0,0,0,0,0,0,0,0,0,0,0,0,0,0,0,0,0,0,0,0,0,0,0,0,0,0,0,0,0,0,0,0,0,0,0,0,0,0,0,0,null,null,null,"18. Medicina muncii",null,21,0,0,0]
["19. Medicină sportivă",null,22,0,0,0,0,0,0,0,0,0,0,0,0,0,0,0,0,0,0,0,0,0,0,0,0,0,0,0,0,0,0,0,0,0,0,0,0,0,0,0,0,0,0,0,0,0,0,0,0,0,0,0,0,0,0,0,0,0,0,0,0,0,0,0,0,0,0,0,0,0,0,0,0,0,0,0,0,0,0,0,0,0,0,0,0,0,0,0,0,0,0,0,0,0,0,0,0,0,0,0,0,0,0,0,0,0,0,0,0,0,0,0,0,null,null,null,"19. Medicină sportivă",null,22,0,0,0]
["20. Nefrologie",null,23,0,0,0,0,0,0,0,0,0,0,0,0,0,0,0,0,0,0,0,0,0,0,0,0,0,0,0,0,0,0,0,0,0,0,0,0,0,0,0,0,0,0,0,0,0,0,0,0,0,0,0,0,0,0,0,0,0,0,0,0,0,0,0,0,0,0,0,0,0,0,0,0,0,0,0,0,0,0,0,0,0,0,0,0,0,0,0,0,0,0,0,0,0,0,0,0,0,0,0,0,0,0,0,0,0,0,0,0,0,0,0,0,null,null,null,"20. Nefrologie",null,23,0,0,0]
["21. Neonatologie",null,24,0,0,0,0,0,0,0,0,0,0,0,0,0,0,0,0,0,0,0,0,0,0,0,0,0,0,0,0,0,0,0,0,0,0,0,0,0,0,0,0,0,0,0,0,0,0,0,0,0,0,0,0,0,0,0,0,0,0,0,0,0,0,0,0,0,0,0,0,0,0,0,0,0,0,0,0,0,0,0,0,0,0,0,0,0,0,0,0,0,0,0,0,0,0,0,0,0,0,0,0,0,0,0,0,0,0,0,0,0,0,0,0,null,null,null,"21. Neonatologie",null,24,0,0,0]
["22. Neurologie",null,25,0,0,0,0,0,0,0,0,0,0,0,0,0,0,0,0,0,0,0,0,0,0,0,0,0,0,0,0,0,0,0,0,0,0,0,0,0,0,0,0,0,0,0,0,0,0,0,0,0,0,0,0,0,0,0,0,0,0,0,0,0,0,0,0,0,0,0,0,0,0,0,0,0,0,0,0,0,0,0,0,0,0,0,0,0,0,0,0,0,0,0,0,0,0,0,0,0,0,0,0,0,0,0,0,0,0,0,0,0,0,0,0,null,null,null,"22. Neurologie",null,25,0,0,0]
["23. Neurologie pediatrică",null,26,0,0,0,0,0,0,0,0,0,0,0,0,0,0,0,0,0,0,0,0,0,0,0,0,0,0,0,0,0,0,0,0,0,0,0,0,0,0,0,0,0,0,0,0,0,0,0,0,0,0,0,0,0,0,0,0,0,0,0,0,0,0,0,0,0,0,0,0,0,0,0,0,0,0,0,0,0,0,0,0,0,0,0,0,0,0,0,0,0,0,0,0,0,0,0,0,0,0,0,0,0,0,0,0,0,0,0,0,0,0,0,0,null,null,null,"23. Neurologie pediatrică",null,26,0,0,0]
["24. Oncologie medicală",null,27,0,0,0,0,0,0,0,0,0,0,0,0,0,0,0,0,0,0,0,0,0,0,0,0,0,0,0,0,0,0,0,0,0,0,0,0,0,0,0,0,0,0,0,0,0,0,0,0,0,0,0,0,0,0,0,0,0,0,0,0,0,0,0,0,0,0,0,0,0,0,0,0,0,0,0,0,0,0,0,0,0,0,0,0,0,0,0,0,0,0,0,0,0,0,0,0,0,0,0,0,0,0,0,0,0,0,0,0,0,0,0,0,null,null,null,"24. Oncologie medicală",null,27,0,0,0]
["25. Pediatrie",null,28,0,0,0,0,0,0,0,0,0,0,0,0,0,0,0,0,0,0,0,0,0,0,0,0,0,0,0,0,0,0,0,0,0,0,0,0,0,0,0,0,0,0,0,0,0,0,0,0,0,0,0,0,0,0,0,0,0,0,0,0,0,0,0,0,0,0,0,0,0,0,0,0,0,0,0,0,0,0,0,0,0,0,0,0,0,0,0,0,0,0,0,0,0,0,0,0,0,0,0,0,0,0,0,0,0,0,0,0,0,0,0,0,null,null,null,"25. Pediatrie",null,28,0,0,0]
["26. Pneumologie",null,29,0,0,0,0,0,0,0,0,0,0,0,0,0,0,0,0,0,0,0,0,0,0,0,0,0,0,0,0,0,0,0,0,0,0,0,0,0,0,0,0,0,0,0,0,0,0,0,0,0,0,0,0,0,0,0,0,0,0,0,0,0,0,0,0,0,0,0,0,0,0,0,0,0,0,0,0,0,0,0,0,0,0,0,0,0,0,0,0,0,0,0,0,0,0,0,0,0,0,0,0,0,0,0,0,0,0,0,0,0,0,0,0,null,null,null,"26. Pneumologie",null,29,0,0,0]
["27. Psihiatrie ",null,30,0,0,0,0,0,0,0,0,0,0,0,0,0,0,0,0,0,0,0,0,0,0,0,0,0,0,0,0,0,0,0,0,0,0,0,0,0,0,0,0,0,0,0,0,0,0,0,0,0,0,0,0,0,0,0,0,0,0,0,0,0,0,0,0,0,0,0,0,0,0,0,0,0,0,0,0,0,0,0,0,0,0,0,0,0,0,0,0,0,0,0,0,0,0,0,0,0,0,0,0,0,0,0,0,0,0,0,0,0,0,0,0,null,null,null,"27. Psihiatrie ",null,30,0,0,0]
["28. Psihiatrie pediatrică ",null,31,0,0,0,0,0,0,0,0,0,0,0,0,0,0,0,0,0,0,0,0,0,0,0,0,0,0,0,0,0,0,0,0,0,0,0,0,0,0,0,0,0,0,0,0,0,0,0,0,0,0,0,0,0,0,0,0,0,0,0,0,0,0,0,0,0,0,0,0,0,0,0,0,0,0,0,0,0,0,0,0,0,0,0,0,0,0,0,0,0,0,0,0,0,0,0,0,0,0,0,0,0,0,0,0,0,0,0,0,0,0,0,0,null,null,null,"28. Psihiatrie pediatrică ",null,31,0,0,0]
["29. Radioterapie",null,32,0,0,0,0,0,0,0,0,0,0,0,0,0,0,0,0,0,0,0,0,0,0,0,0,0,0,0,0,0,0,0,0,0,0,0,0,0,0,0,0,0,0,0,0,0,0,0,0,0,0,0,0,0,0,0,0,0,0,0,0,0,0,0,0,0,0,0,0,0,0,0,0,0,0,0,0,0,0,0,0,0,0,0,0,0,0,0,0,0,0,0,0,0,0,0,0,0,0,0,0,0,0,0,0,0,0,0,0,0,0,0,0,null,null,null,"29. Radioterapie",null,32,0,0,0]
["30. Recuperare, medicină fizică şi balneologie",null,33,0,0,0,0,0,0,0,0,0,0,0,0,0,0,0,0,0,0,0,0,0,0,0,0,0,0,0,0,0,0,0,0,0,0,0,0,0,0,0,0,0,0,0,0,0,0,0,0,0,0,0,0,0,0,0,0,0,0,0,0,0,0,0,0,0,0,0,0,0,0,0,0,0,0,0,0,0,0,0,0,0,0,0,0,0,0,0,0,0,0,0,0,0,0,0,0,0,0,0,0,0,0,0,0,0,0,0,0,0,0,0,0,null,null,null,"30. Recuperare, medicină fizică şi balneologie",null,33,{"$f":"+D221-D140","v":0},0,0]
["31. Reumatologie",null,34,0,0,0,0,0,0,0,0,0,0,0,0,0,0,0,0,0,0,0,0,0,0,0,0,0,0,0,0,0,0,0,0,0,0,0,0,0,0,0,0,0,0,0,0,0,0,0,0,0,0,0,0,0,0,0,0,0,0,0,0,0,0,0,0,0,0,0,0,0,0,0,0,0,0,0,0,0,0,0,0,0,0,0,0,0,0,0,0,0,0,0,0,0,0,0,0,0,0,0,0,0,0,0,0,0,0,0,0,0,0,0,0,null,null,null,"31. Reumatologie",null,34,0,0,0]
["32. Chirurgie cardiovasculară",null,35,0,0,0,0,0,0,0,0,0,0,0,0,0,0,0,0,0,0,0,0,0,0,0,0,0,0,0,0,0,0,0,0,0,0,0,0,0,0,0,0,0,0,0,0,0,0,0,0,0,0,0,0,0,0,0,0,0,0,0,0,0,0,0,0,0,0,0,0,0,0,0,0,0,0,0,0,0,0,0,0,0,0,0,0,0,0,0,0,0,0,0,0,0,0,0,0,0,0,0,0,0,0,0,0,0,0,0,0,0,0,0,0,null,null,null,"32. Chirurgie cardiovasculară",null,35,0,0,0]
["33. Chirurgie generală",null,36,0,0,0,0,0,0,0,0,0,0,0,0,0,0,0,0,0,0,0,0,0,0,0,0,0,0,0,0,0,0,0,0,0,0,0,0,0,0,0,0,0,0,0,0,0,0,0,0,0,0,0,0,0,0,0,0,0,0,0,0,0,0,0,0,0,0,0,0,0,0,0,0,0,0,0,0,0,0,0,0,0,0,0,0,0,0,0,0,0,0,0,0,0,0,0,0,0,0,0,0,0,0,0,0,0,0,0,0,0,0,0,0,null,null,null,"33. Chirurgie generală",null,36,0,0,0]
["34. Chirurgie orală şi maxilo- facială",null,37,0,0,0,0,0,0,0,0,0,0,0,0,0,0,0,0,0,0,0,0,0,0,0,0,0,0,0,0,0,0,0,0,0,0,0,0,0,0,0,0,0,0,0,0,0,0,0,0,0,0,0,0,0,0,0,0,0,0,0,0,0,0,0,0,0,0,0,0,0,0,0,0,0,0,0,0,0,0,0,0,0,0,0,0,0,0,0,0,0,0,0,0,0,0,0,0,0,0,0,0,0,0,0,0,0,0,0,0,0,0,0,0,null,null,null,"34. Chirurgie orală şi maxilo- facială",null,37,0,0,0]
["35. Chirurgie pediatrică",null,38,0,0,0,0,0,0,0,0,0,0,0,0,0,0,0,0,0,0,0,0,0,0,0,0,0,0,0,0,0,0,0,0,0,0,0,0,0,0,0,0,0,0,0,0,0,0,0,0,0,0,0,0,0,0,0,0,0,0,0,0,0,0,0,0,0,0,0,0,0,0,0,0,0,0,0,0,0,0,0,0,0,0,0,0,0,0,0,0,0,0,0,0,0,0,0,0,0,0,0,0,0,0,0,0,0,0,0,0,0,0,0,0,null,null,null,"35. Chirurgie pediatrică",null,38,{"$f":"+D227-D145","v":0},0,0]
["36. Chirurgie plastică-microchirurgie reconstructivă",null,39,0,0,0,0,0,0,0,0,0,0,0,0,0,0,0,0,0,0,0,0,0,0,0,0,0,0,0,0,0,0,0,0,0,0,0,0,0,0,0,0,0,0,0,0,0,0,0,0,0,0,0,0,0,0,0,0,0,0,0,0,0,0,0,0,0,0,0,0,0,0,0,0,0,0,0,0,0,0,0,0,0,0,0,0,0,0,0,0,0,0,0,0,0,0,0,0,0,0,0,0,0,0,0,0,0,0,0,0,0,0,0,0,null,null,null,"36. Chirurgie plastică-microchirurgie reconstructivă",null,39,0,0,0]
["37. Chirurgie toracică",null,40,0,0,0,0,0,0,0,0,0,0,0,0,0,0,0,0,0,0,0,0,0,0,0,0,0,0,0,0,0,0,0,0,0,0,0,0,0,0,0,0,0,0,0,0,0,0,0,0,0,0,0,0,0,0,0,0,0,0,0,0,0,0,0,0,0,0,0,0,0,0,0,0,0,0,0,0,0,0,0,0,0,0,0,0,0,0,0,0,0,0,0,0,0,0,0,0,0,0,0,0,0,0,0,0,0,0,0,0,0,0,0,0,null,null,null,"37. Chirurgie toracică",null,40,0,0,0]
["38. Chirurgie vasculară",null,41,0,0,0,0,0,0,0,0,0,0,0,0,0,0,0,0,0,0,0,0,0,0,0,0,0,0,0,0,0,0,0,0,0,0,0,0,0,0,0,0,0,0,0,0,0,0,0,0,0,0,0,0,0,0,0,0,0,0,0,0,0,0,0,0,0,0,0,0,0,0,0,0,0,0,0,0,0,0,0,0,0,0,0,0,0,0,0,0,0,0,0,0,0,0,0,0,0,0,0,0,0,0,0,0,0,0,0,0,0,0,0,0,null,null,null,"38. Chirurgie vasculară",null,41,0,0,0]
["39. Neurochirurgie",null,42,0,0,0,0,0,0,0,0,0,0,0,0,0,0,0,0,0,0,0,0,0,0,0,0,0,0,0,0,0,0,0,0,0,0,0,0,0,0,0,0,0,0,0,0,0,0,0,0,0,0,0,0,0,0,0,0,0,0,0,0,0,0,0,0,0,0,0,0,0,0,0,0,0,0,0,0,0,0,0,0,0,0,0,0,0,0,0,0,0,0,0,0,0,0,0,0,0,0,0,0,0,0,0,0,0,0,0,0,0,0,0,0,null,null,null,"39. Neurochirurgie",null,42,0,0,0]
["40. Obstetrică- ginecologie",null,43,0,0,0,0,0,0,0,0,0,0,0,0,0,0,0,0,0,0,0,0,0,0,0,0,0,0,0,0,0,0,0,0,0,0,0,0,0,0,0,0,0,0,0,0,0,0,0,0,0,0,0,0,0,0,0,0,0,0,0,0,0,0,0,0,0,0,0,0,0,0,0,0,0,0,0,0,0,0,0,0,0,0,0,0,0,0,0,0,0,0,0,0,0,0,0,0,0,0,0,0,0,0,0,0,0,0,0,0,0,0,0,0,null,null,null,"40. Obstetrică- ginecologie",null,43,0,0,0]
["41. Oftalmologie",null,44,0,0,0,0,0,0,0,0,0,0,0,0,0,0,0,0,0,0,0,0,0,0,0,0,0,0,0,0,0,0,0,0,0,0,0,0,0,0,0,0,0,0,0,0,0,0,0,0,0,0,0,0,0,0,0,0,0,0,0,0,0,0,0,0,0,0,0,0,0,0,0,0,0,0,0,0,0,0,0,0,0,0,0,0,0,0,0,0,0,0,0,0,0,0,0,0,0,0,0,0,0,0,0,0,0,0,0,0,0,0,0,0,null,null,null,"41. Oftalmologie",null,44,0,0,0]
["42. Ortopedie pediatrică",null,45,0,0,0,0,0,0,0,0,0,0,0,0,0,0,0,0,0,0,0,0,0,0,0,0,0,0,0,0,0,0,0,0,0,0,0,0,0,0,0,0,0,0,0,0,0,0,0,0,0,0,0,0,0,0,0,0,0,0,0,0,0,0,0,0,0,0,0,0,0,0,0,0,0,0,0,0,0,0,0,0,0,0,0,0,0,0,0,0,0,0,0,0,0,0,0,0,0,0,0,0,0,0,0,0,0,0,0,0,0,0,0,0,null,null,null,"42. Ortopedie pediatrică",null,45,0,0,0]
["43. Ortopedie şi traumatologie",null,46,0,0,0,0,0,0,0,0,0,0,0,0,0,0,0,0,0,0,0,0,0,0,0,0,0,0,0,0,0,0,0,0,0,0,0,0,0,0,0,0,0,0,0,0,0,0,0,0,0,0,0,0,0,0,0,0,0,0,0,0,0,0,0,0,0,0,0,0,0,0,0,0,0,0,0,0,0,0,0,0,0,0,0,0,0,0,0,0,0,0,0,0,0,0,0,0,0,0,0,0,0,0,0,0,0,0,0,0,0,0,0,0,null,null,null,"43. Ortopedie şi traumatologie",null,46,0,0,0]
["44. O.R.L.",null,47,0,0,0,0,0,0,0,0,0,0,0,0,0,0,0,0,0,0,0,0,0,0,0,0,0,0,0,0,0,0,0,0,0,0,0,0,0,0,0,0,0,0,0,0,0,0,0,0,0,0,0,0,0,0,0,0,0,0,0,0,0,0,0,0,0,0,0,0,0,0,0,0,0,0,0,0,0,0,0,0,0,0,0,0,0,0,0,0,0,0,0,0,0,0,0,0,0,0,0,0,0,0,0,0,0,0,0,0,0,0,0,0,null,null,null,"44. O.R.L.",null,47,0,0,0]
["45. Urologie",null,48,0,0,0,0,0,0,0,0,0,0,0,0,0,0,0,0,0,0,0,0,0,0,0,0,0,0,0,0,0,0,0,0,0,0,0,0,0,0,0,0,0,0,0,0,0,0,0,0,0,0,0,0,0,0,0,0,0,0,0,0,0,0,0,0,0,0,0,0,0,0,0,0,0,0,0,0,0,0,0,0,0,0,0,0,0,0,0,0,0,0,0,0,0,0,0,0,0,0,0,0,0,0,0,0,0,0,0,0,0,0,0,0,null,null,null,"45. Urologie",null,48,0,0,0]
["46. Anatomie patologică",null,49,0,0,0,0,0,0,0,0,0,0,0,0,0,0,0,0,0,0,0,0,0,0,0,0,0,0,0,0,0,0,0,0,0,0,0,0,0,0,0,0,0,0,0,0,0,0,0,0,0,0,0,0,0,0,0,0,0,0,0,0,0,0,0,0,0,0,0,0,0,0,0,0,0,0,0,0,0,0,0,0,0,0,0,0,0,0,0,0,0,0,0,0,0,0,0,0,0,0,0,0,0,0,0,0,0,0,0,0,0,0,0,0,null,null,null,"46. Anatomie patologică",null,49,0,0,0]
["47. Epidemiologie",null,50,0,0,0,0,0,0,0,0,0,0,0,0,0,0,0,0,0,0,0,0,0,0,0,0,0,0,0,0,0,0,0,0,0,0,0,0,0,0,0,0,0,0,0,0,0,0,0,0,0,0,0,0,0,0,0,0,0,0,0,0,0,0,0,0,0,0,0,0,0,0,0,0,0,0,0,0,0,0,0,0,0,0,0,0,0,0,0,0,0,0,0,0,0,0,0,0,0,0,0,0,0,0,0,0,0,0,0,0,0,0,0,0,null,null,null,"47. Epidemiologie",null,50,0,0,0]
["48. Igienă",null,51,0,0,0,0,0,0,0,0,0,0,0,0,0,0,0,0,0,0,0,0,0,0,0,0,0,0,0,0,0,0,0,0,0,0,0,0,0,0,0,0,0,0,0,0,0,0,0,0,0,0,0,0,0,0,0,0,0,0,0,0,0,0,0,0,0,0,0,0,0,0,0,0,0,0,0,0,0,0,0,0,0,0,0,0,0,0,0,0,0,0,0,0,0,0,0,0,0,0,0,0,0,0,0,0,0,0,0,0,0,0,0,0,null,null,null,"48. Igienă",null,51,0,0,0]
["49. Medicină de laborator",null,52,0,0,0,0,0,0,0,0,0,0,0,0,0,0,0,0,0,0,0,0,0,0,0,0,0,0,0,0,0,0,0,0,0,0,0,0,0,0,0,0,0,0,0,0,0,0,0,0,0,0,0,0,0,0,0,0,0,0,0,0,0,0,0,0,0,0,0,0,0,0,0,0,0,0,0,0,0,0,0,0,0,0,0,0,0,0,0,0,0,0,0,0,0,0,0,0,0,0,0,0,0,0,0,0,0,0,0,0,0,0,0,0,null,null,null,"49. Medicină de laborator",null,52,0,0,0]
["50. Medicină legală",null,53,0,0,0,0,0,0,0,0,0,0,0,0,0,0,0,0,0,0,0,0,0,0,0,0,0,0,0,0,0,0,0,0,0,0,0,0,0,0,0,0,0,0,0,0,0,0,0,0,0,0,0,0,0,0,0,0,0,0,0,0,0,0,0,0,0,0,0,0,0,0,0,0,0,0,0,0,0,0,0,0,0,0,0,0,0,0,0,0,0,0,0,0,0,0,0,0,0,0,0,0,0,0,0,0,0,0,0,0,0,0,0,0,null,null,null,"50. Medicină legală",null,53,0,0,0]
["51. Medicină nucleară",null,54,0,0,0,0,0,0,0,0,0,0,0,0,0,0,0,0,0,0,0,0,0,0,0,0,0,0,0,0,0,0,0,0,0,0,0,0,0,0,0,0,0,0,0,0,0,0,0,0,0,0,0,0,0,0,0,0,0,0,0,0,0,0,0,0,0,0,0,0,0,0,0,0,0,0,0,0,0,0,0,0,0,0,0,0,0,0,0,0,0,0,0,0,0,0,0,0,0,0,0,0,0,0,0,0,0,0,0,0,0,0,0,0,null,null,null,"51. Medicină nucleară",null,54,0,0,0]
["52. Radiologie – imagistică medicală",null,55,0,0,0,0,0,0,0,0,0,0,0,0,0,0,0,0,0,0,0,0,0,0,0,0,0,0,0,0,0,0,0,0,0,0,0,0,0,0,0,0,0,0,0,0,0,0,0,0,0,0,0,0,0,0,0,0,0,0,0,0,0,0,0,0,0,0,0,0,0,0,0,0,0,0,0,0,0,0,0,0,0,0,0,0,0,0,0,0,0,0,0,0,0,0,0,0,0,0,0,0,0,0,0,0,0,0,0,0,0,0,0,0,null,null,null,"52. Radiologie – imagistică medicală",null,55,0,0,0]
["53. Sănătate publică şi management",null,56,0,0,0,0,0,0,0,0,0,0,0,0,0,0,0,0,0,0,0,0,0,0,0,0,0,0,0,0,0,0,0,0,0,0,0,0,0,0,0,0,0,0,0,0,0,0,0,0,0,0,0,0,0,0,0,0,0,0,0,0,0,0,0,0,0,0,0,0,0,0,0,0,0,0,0,0,0,0,0,0,0,0,0,0,0,0,0,0,0,0,0,0,0,0,0,0,0,0,0,0,0,0,0,0,0,0,0,0,0,0,0,0,null,null,null,"53. Sănătate publică şi management",null,56,0,0,0]
["II. DENTIŞTI -  TOTAL,                      din care:",null,57,0,0,0,0,0,0,0,0,0,0,0,0,0,0,0,0,0,0,0,0,0,0,0,0,0,0,0,0,0,0,0,0,0,0,0,0,0,0,0,0,0,0,0,0,0,0,0,0,0,0,0,0,0,0,0,0,0,0,0,0,0,0,0,0,0,0,0,0,0,0,0,0,0,0,0,0,0,0,0,0,0,0,0,0,0,0,0,0,0,0,0,0,0,0,0,0,0,0,0,0,0,0,0,0,0,0,0,0,0,0,0,0,null,null,null,"II. DENTIŞTI TOTAL, din care:",null,57,0,0,0]
["           - rezidenţi",null,58,0,0,0,0,0,0,0,0,0,0,0,0,0,0,0,0,0,0,0,0,0,0,0,0,0,0,0,0,0,0,0,0,0,0,0,0,0,0,0,0,0,0,0,0,0,0,0,0,0,0,0,0,0,0,0,0,0,0,0,0,0,0,0,0,0,0,0,0,0,0,0,0,0,0,0,0,0,0,0,0,0,0,0,0,0,0,0,0,0,0,0,0,0,0,0,0,0,0,0,0,0,0,0,0,0,0,0,0,0,0,0,0,null,null,null,"           - rezidenţi",null,58,0,0,0]
["1. Chirurgie dento-alveolară",null,59,0,0,0,0,0,0,0,0,0,0,0,0,0,0,0,0,0,0,0,0,0,0,0,0,0,0,0,0,0,0,0,0,0,0,0,0,0,0,0,0,0,0,0,0,0,0,0,0,0,0,0,0,0,0,0,0,0,0,0,0,0,0,0,0,0,0,0,0,0,0,0,0,0,0,0,0,0,0,0,0,0,0,0,0,0,0,0,0,0,0,0,0,0,0,0,0,0,0,0,0,0,0,0,0,0,0,0,0,0,0,0,0,null,null,null,"1. Chirurgie dento-alveolară",null,59,0,0,0]
["2. Ortodonţie şi ortopedie dento-facială",null,60,0,0,0,0,0,0,0,0,0,0,0,0,0,0,0,0,0,0,0,0,0,0,0,0,0,0,0,0,0,0,0,0,0,0,0,0,0,0,0,0,0,0,0,0,0,0,0,0,0,0,0,0,0,0,0,0,0,0,0,0,0,0,0,0,0,0,0,0,0,0,0,0,0,0,0,0,0,0,0,0,0,0,0,0,0,0,0,0,0,0,0,0,0,0,0,0,0,0,0,0,0,0,0,0,0,0,0,0,0,0,0,0,null,null,null,"2. Ortodonţie şi ortopedie dento-facială",null,60,0,0,0]
["III. FARMACIŞTI – TOTAL,              din care:",null,61,0,0,0,0,{"$f":"+G168-I168","v":0},0,0,0,0,0,0,0,0,0,0,0,0,0,0,0,0,0,0,0,0,0,0,0,0,0,0,0,0,0,0,0,0,0,0,0,0,0,0,0,0,0,0,0,0,0,0,0,0,0,0,0,0,0,0,0,0,0,0,0,0,0,0,0,0,0,0,0,0,0,0,0,0,0,0,0,0,0,0,0,0,0,0,0,0,0,0,0,0,0,0,0,0,0,0,0,0,0,0,0,0,0,0,0,0,0,0,0,null,null,null,"III. FARMACIŞTI – TOTAL, din care:",null,61,0,0,0]
["          - rezidenţi",null,62,0,0,0,0,{"$f":"+G169-I169","v":0},0,0,0,0,0,0,0,0,0,0,0,0,0,0,0,0,0,0,0,0,0,0,0,0,0,0,0,0,0,0,0,0,0,0,0,0,0,0,0,0,0,0,0,0,0,0,0,0,0,0,0,0,0,0,0,0,0,0,0,0,0,0,0,0,0,0,0,0,0,0,0,0,0,0,0,0,0,0,0,0,0,0,0,0,0,0,0,0,0,0,0,0,0,0,0,0,0,0,0,0,0,0,0,0,0,0,0,null,null,null,"          - rezidenţi",null,62,0,0,0]
["1. Farmacie clinică",null,63,0,0,0,0,0,0,0,0,0,0,0,0,0,0,0,0,0,0,0,0,0,0,0,0,0,0,0,0,0,0,0,0,0,0,0,0,0,0,0,0,0,0,0,0,0,0,0,0,0,0,0,0,0,0,0,0,0,0,0,0,0,0,0,0,0,0,0,0,0,0,0,0,0,0,0,0,0,0,0,0,0,0,0,0,0,0,0,0,0,0,0,0,0,0,0,0,0,0,0,0,0,0,0,0,0,0,0,0,0,0,0,0,null,null,null,"1. Farmacie clinică",null,63,0,0,0]
["2. Laborator farmaceutic",null,64,0,0,0,0,0,0,0,0,0,0,0,0,0,0,0,0,0,0,0,0,0,0,0,0,0,0,0,0,0,0,0,0,0,0,0,0,0,0,0,0,0,0,0,0,0,0,0,0,0,0,0,0,0,0,0,0,0,0,0,0,0,0,0,0,0,0,0,0,0,0,0,0,0,0,0,0,0,0,0,0,0,0,0,0,0,0,0,0,0,0,0,0,0,0,0,0,0,0,0,0,0,0,0,0,0,0,0,0,0,0,0,0,null,null,null,"2. Laborator farmaceutic",null,64,0,0,0]
["IV. FIZIOKINETOTERAPEUŢI - TOTAL, din care:",null,65,0,0,0,0,0,0,0,0,0,0,0,0,0,0,0,0,0,0,0,0,0,0,0,0,0,0,0,0,0,0,0,0,0,0,0,0,0,0,0,0,0,0,0,0,0,0,0,0,0,0,0,0,0,0,0,0,0,0,0,0,0,0,0,0,0,0,0,0,0,0,0,0,0,0,0,0,0,0,0,0,0,0,0,0,0,0,0,0,0,0,0,0,0,0,0,0,0,0,0,0,0,0,0,0,0,0,0,0,0,0,0,0,null,null,null,"IV. FIZIOKINETOTERAPEUŢI, din care:",null,65,0,0,0]
["          - fizioterapeuţi  ",null,66,0,0,0,0,0,0,0,0,0,0,0,0,0,0,0,0,0,0,0,0,0,0,0,0,0,0,0,0,0,0,0,0,0,0,0,0,0,0,0,0,0,0,0,0,0,0,0,0,0,0,0,0,0,0,0,0,0,0,0,0,0,0,0,0,0,0,0,0,0,0,0,0,0,0,0,0,0,0,0,0,0,0,0,0,0,0,0,0,0,0,0,0,0,0,0,0,0,0,0,0,0,0,0,0,0,0,0,0,0,0,0,0,null,null,null,"          - fizioterapeuţi  ",null,66,0,0,0]
["V. ASISTENŢI MEDICALI CU STUDII SUPERIOARE - TOTAL,       din care:",null,67,0,0,0,0,0,0,0,0,0,0,0,0,0,0,0,0,0,0,0,0,0,0,0,0,0,0,0,0,0,0,0,0,0,0,0,0,0,0,0,0,0,0,0,0,0,0,0,0,0,0,0,0,0,0,0,0,0,0,0,0,0,0,0,0,0,0,0,0,0,0,0,0,0,0,0,0,0,0,0,0,0,0,0,0,0,0,0,0,0,0,0,0,0,0,0,0,0,0,0,0,0,0,0,0,0,0,0,0,0,0,0,0,null,null,null,"V. ASISTENŢI MEDICALI CU STUDII SUPERIOARE, din care:",null,67,0,0,0]
["       - asistenţi medicali obstetrică- ginecologie (moaşe)",null,68,{"$f":"+E175+F175","v":0},{"$f":"+Q175+T175+W175+Z175+AC175+AF175+AI175+AL175+AO175+AR175+AU175+AX175+BA175+BD175+BG175+BJ175+BM175+BP175+BS175+BV175+BY175+CB175+CE175+CH175+CK175+CN175+CQ175+CT175+CW175+CZ175+DC175+DF175+DI175","v":0},{"$f":"R175+U175+X175+AA175+AD175+AG175+AJ175+AM175+AP175+AS175+AV175+AY175+BB175+BE175+BH175+BK175+BN175+BQ175+BT175+BW175+BZ175+CC175+CF175+CI175+CL175+CO175+CR175+CU175+CX175+DA175+DD175+DG175+DJ175","v":0},0,0,0,0,0,0,0,{"$f":"+M175-O175","v":0},0,0,0,0,0,0,0,0,0,0,0,0,0,0,0,0,0,0,0,0,0,0,0,0,0,0,0,0,0,0,0,0,0,0,0,0,0,0,0,0,0,0,0,0,0,0,0,0,0,0,0,0,0,0,0,0,0,0,0,0,0,0,0,0,0,0,0,0,0,0,0,0,0,0,0,0,0,0,0,0,0,0,0,0,0,0,0,0,0,0,0,0,0,0,0,0,0,0,0,0,0,null,null,null,"       - asistenţi medicali obstetrică-       ginecologie (moaşe)",null,68,0,0,0]
["VI. ALT PERSONAL SANITAR SUPERIOR (biologi, chimişti, logopezi, profesori CFM, psihologi)",null,69,{"$f":"+E176+F176","v":0},0,0,0,0,0,0,{"$f":"+J176-L176","v":0},0,0,{"$f":"+M176-O176","v":0},0,0,0,0,0,0,0,0,0,0,0,0,0,0,0,0,0,0,0,0,0,0,0,0,0,0,0,0,0,0,0,0,0,0,0,0,0,0,0,0,0,0,0,0,0,0,0,0,0,0,0,0,0,0,0,0,0,0,0,0,0,0,0,0,0,0,0,0,0,0,0,0,0,0,0,0,0,0,0,0,0,0,0,0,0,0,0,0,0,0,0,0,0,0,0,0,0,0,0,0,0,null,null,null,"VI. ALT PERSONAL SANITAR SUPERIOR (biologi, chimişti, logopezi, profesori CFM, psihologi)",null,69,0,0,0]
["VII. ALT PERSONAL CU STUDII SUPERIOARE (economişti,jurişti, ingineri etc)",null,70,{"$f":"+E177+F177","v":0},0,0,0,0,0,0,0,0,0,{"$f":"+M177-O177","v":0},0,0,0,0,0,0,0,0,0,0,0,0,0,0,0,0,0,0,0,0,0,0,0,0,0,0,0,0,0,0,0,0,0,0,0,0,0,0,0,0,0,0,0,0,0,0,0,0,0,0,0,0,0,0,0,0,0,0,0,0,0,0,0,0,0,0,0,0,0,0,0,0,0,0,0,0,0,0,0,0,0,0,0,0,0,0,0,0,0,0,0,0,0,0,0,0,0,0,0,0,0,null,null,null,"VII. ALT PERSONAL CU STUDII SUPERIOARE (economişti,jurişti, ingineri etc)",null,70,0,0,0]
[null,"U.M.F. *)  - este trecut personalul sanitar cu cartea de muncă la Universitatatea de Medicină şi Farmacie şi care are integrare clinică. Nu se prinde în total ( coloana 01)."]
[]
[]
[]
["Cap.15. PERSONAL SANITAR CU STUDII SUPERIOARE PE GRUPE DE VÂRSTĂ"]
["D"]
["CATEGORII DE PERSONAL",null,"Randul","TOTAL",null,null,"            Repartizarea personalului cu studii superioare pe grupe de vârstă",null,null,null,null,null,null,null,null,null,null,null,null,null,null,null,null,null,"Cu normă întreagă"]
[null,null,null,"TOTAL","MASCULIN","FEMININ","Sub 25 ani",null,null,"25-34 ani",null,null,"35-44 ani",null,null,"45-54 ani",null,null,"55-64 ani",null,null,"65 ani şi peste",null,null,"Total",null,null,"din care: in spital, centru de sanatate cu paturi, san. TBC, preventorii, san. de nevroze/neuropsihiatrie, san. balneare"]
[null,null,null,null,null,null,"Total","din care:",null,"Total","din care:",null,"Total","din care:",null,"Total","din care:",null,"Total","din care:",null,"Total","din care:",null,"Total","din care:",null,"Total","din care:"]
[null,null,null,null,null,null,null,"masculin","feminin",null,"masculin","feminin",null,"masculin","feminin",null,"masculin","feminin",null,"masculin","feminin",null,"masculin","feminin",null,"masculin","feminin",null,"masculin","feminin"]
["A",null,"B",1,2,3,4,5,6,7,8,9,10,11,12,13,14,15,16,17,18,19,20,21,22,23,24,25,26,27]
["TOTAL PERSONAL CU STUDII SUPERIOARE (rândurile  2+57+61+65+67+69+70)",null,1,{"$f":"+D190+D246+D250+D254+D256+D258+D259","v":0},0,0,0,0,0,0,0,0,0,0,0,0,0,0,0,0,0,0,0,0,0,0,0,0,0,0]
["I. MEDICI (EXCLUSIV DENTIŞTI) – TOTAL     (rândurile  4+......+56),                   din care:",null,2,{"$f":"SUM(D192:D245)-D226","v":0},{"$f":"SUM(E192:E245)-E226","v":0},0,0,0,0,0,0,0,0,0,0,0,0,0,0,0,0,0,0,0,0,0,0,0,0,0]
["                    - rezidenţi ",null,3,{"$f":"+E191+F191","v":0},{"$f":"+H191+K191+N191+Q191+T191+W191","v":0},{"$f":"+I191+L191+O191+R191+U191+X191","v":0},0,{"$f":"+G191-I191","v":0},0,0,{"$f":"+J191-L191","v":0},0,0,{"$f":"+M191-O191","v":0},0,0,{"$f":"+P191-R191","v":0},0,0,{"$f":"+S191-U191","v":0},0,0,{"$f":"+V191-X191","v":0},0,0,{"$f":"+Y191-AA191","v":0},0,0,{"$f":"+AB191-AD191","v":0},0,{"$f":"IF((E191>=Z191),\"OK\",\"Err\")","v":"OK"},"OK",{"$f":"IF((Z191>=AC191),\"OK\",\"Err\")","v":"OK"},"OK"]
["1. Alergologie şi imunologie clinică",null,4,{"$f":"+E192+F192","v":0},{"$f":"+H192+K192+N192+Q192+T192+W192","v":0},0,0,{"$f":"+G192-I192","v":0},0,0,{"$f":"+J192-L192","v":0},0,0,{"$f":"+M192-O192","v":0},0,0,{"$f":"+P192-R192","v":0},0,0,{"$f":"+S192-U192","v":0},0,0,{"$f":"+V192-X192","v":0},0,0,{"$f":"+Y192-AA192","v":0},0,0,{"$f":"+AB192-AD192","v":0},0,"OK","OK","OK","OK"]
["2. A.T.I.",null,5,0,0,0,0,0,0,0,0,0,0,0,0,0,0,0,0,0,0,0,0,0,0,0,0,0,0,0,"OK","OK","OK","OK"]
["3. Boli infecţioase",null,6,0,0,0,0,0,0,0,0,0,0,0,0,0,0,0,0,0,0,0,0,0,0,0,0,0,0,0,"OK","OK","OK","OK"]
["4. Cardiologie",null,7,0,0,0,0,0,0,0,0,0,0,0,0,0,0,0,0,0,0,0,0,0,0,0,0,0,0,0,"OK","OK","OK","OK"]
["5. Dermatovenerologie",null,8,0,0,0,0,0,0,0,0,0,0,0,0,0,0,0,0,0,0,0,0,0,0,0,0,0,0,0,"OK","OK","OK","OK"]
["6. Diabet zaharat, nutriţie şi boli metabolice",null,9,0,0,0,0,0,0,0,0,0,0,0,0,0,0,0,0,0,0,0,0,0,0,0,0,0,0,0,"OK","OK","OK","OK"]
["7. Endocrinologie",null,10,0,0,0,0,0,0,0,0,0,0,0,0,0,0,0,0,0,0,0,0,0,0,0,0,0,0,0,"OK","OK","OK","OK"]
["8. Expertiza medicală a capacităţii de muncă",null,11,0,0,0,0,0,0,0,0,0,0,0,0,0,0,0,0,0,0,0,0,0,0,0,0,0,0,0,"OK","OK","OK","OK"]
["9. Farmacologie clinică",null,12,0,0,0,0,0,0,0,0,0,0,0,0,0,0,0,0,0,0,0,0,0,0,0,0,0,0,0,"OK","OK","OK","OK"]
["10. Gastroenterologie",null,13,0,0,0,0,0,0,0,0,0,0,0,0,0,0,0,0,0,0,0,0,0,0,0,0,0,0,0,"OK","OK","OK","OK"]
["11. Genetică medicală",null,14,0,0,0,0,0,0,0,0,0,0,0,0,0,0,0,0,0,0,0,0,0,0,0,0,0,0,0,"OK","OK","OK","OK"]
["12. Geriatrie şi gerontologie",null,15,0,0,0,0,0,0,0,0,0,0,0,0,0,0,0,0,0,0,0,0,0,0,0,0,0,0,0,"OK","OK","OK","OK"]
["13. Hematologie",null,16,0,0,0,0,0,0,0,0,0,0,0,0,0,0,0,0,0,0,0,0,0,0,0,0,0,0,0,"OK","OK","OK","OK"]
["14. Medicină de familie",null,17,0,0,0,0,0,0,0,0,0,0,0,0,0,0,0,0,0,0,0,0,0,0,0,0,0,0,0,"OK","OK","OK","OK"]
["15. Medicină de urgenţă",null,18,0,0,0,0,0,0,0,0,0,0,0,0,0,0,0,0,0,0,0,0,0,0,0,0,0,0,0,"OK","OK","OK","OK"]
["16. Medicină internă",null,19,0,0,0,0,0,0,0,0,0,0,0,0,0,0,0,0,0,0,0,0,0,0,0,0,0,0,0,"OK","OK","OK","OK"]
["17. Medicină generală",null,20,0,0,0,0,0,0,0,0,0,0,0,0,0,0,0,0,0,0,0,0,0,0,0,0,0,0,0,"OK","OK","OK","OK"]
["18. Medicina muncii",null,21,0,0,0,0,0,0,0,0,0,0,0,0,0,0,0,0,0,0,0,0,0,0,0,0,0,0,0,"OK","OK","OK","OK"]
["19. Medicină sportivă",null,22,0,0,0,0,0,0,0,0,0,0,0,0,0,0,0,0,0,0,0,0,0,0,0,0,0,0,0,"OK","OK","OK","OK"]
["20. Nefrologie",null,23,0,0,0,0,0,0,0,0,0,0,0,0,0,0,0,0,0,0,0,0,0,0,0,0,0,0,0,"OK","OK","OK","OK"]
["21. Neonatologie",null,24,0,0,0,0,0,0,0,0,0,0,0,0,0,0,0,0,0,0,0,0,0,0,0,0,0,0,0,"OK","OK","OK","OK"]
["22. Neurologie",null,25,0,0,0,0,0,0,0,0,0,0,0,0,0,0,0,0,0,0,0,0,0,0,0,0,0,0,0,"OK","OK","OK","OK"]
["23. Neurologie pediatrică",null,26,0,0,0,0,0,0,0,0,0,0,0,0,0,0,0,0,0,0,0,0,0,0,0,0,0,0,0,"OK","OK","OK","OK"]
["24. Oncologie medicală",null,27,0,0,0,0,0,0,0,0,0,0,0,0,0,0,0,0,0,0,0,0,0,0,0,0,0,0,0,"OK","OK","OK","OK"]
["25. Pediatrie",null,28,0,0,0,0,0,0,0,0,0,0,0,0,0,0,0,0,0,0,0,0,0,0,0,0,0,0,0,"OK","OK","OK","OK"]
["26. Pneumologie",null,29,0,0,0,0,0,0,0,0,0,0,0,0,0,0,0,0,0,0,0,0,0,0,0,0,0,0,0,"OK","OK","OK","OK"]
["27. Psihiatrie ",null,30,0,0,0,0,0,0,0,0,0,0,0,0,0,0,0,0,0,0,0,0,0,0,0,0,0,0,0,"OK","OK","OK","OK"]
["28. Psihiatrie pediatrică ",null,31,0,0,0,0,0,0,0,0,0,0,0,0,0,0,0,0,0,0,0,0,0,0,0,0,0,0,0,"OK","OK","OK","OK"]
["29. Radioterapie",null,32,0,0,0,0,0,0,0,0,0,0,0,0,0,0,0,0,0,0,0,0,0,0,0,0,0,0,0,"OK","OK","OK","OK"]
["30. Recuperare, medicină fizică şi balneologie",null,33,0,0,0,0,0,0,0,0,0,0,0,0,0,0,0,0,0,0,0,0,0,0,0,0,0,0,0,"OK","OK","OK","OK"]
["31. Reumatologie",null,34,0,0,0,0,0,0,0,0,0,0,0,0,0,0,0,0,0,0,0,0,0,0,0,0,0,0,0,"OK","OK","OK","OK"]
["32. Chirurgie cardiovasculară",null,35,0,0,0,0,0,0,0,0,0,0,0,0,0,0,0,0,0,0,0,0,0,0,0,0,0,0,0,{"$f":"IF((E223>=Z223),\"OK\",\"Err\")","v":"OK"},"OK",{"$f":"IF((Z223>=AC223),\"OK\",\"Err\")","v":"OK"},"OK"]
["33. Chirurgie generală",null,36,0,0,0,0,0,0,0,0,0,0,0,0,0,0,0,0,0,0,0,0,0,0,0,0,0,0,0,"OK","OK","OK","OK"]
["34. Chirurgie orală şi maxilo- facială din care:",null,37,0,0,0,0,0,0,0,0,0,0,0,0,0,0,0,0,0,0,0,0,0,0,0,0,0,0,0,"OK","OK","OK","OK"]
["      - rezidenți de chirurgie orală și maxilo-facială",null,38,0,0,0,0,0,0,0,0,0,0,0,0,0,0,0,0,0,0,0,0,0,0,0,0,0,0,0,"OK","OK","OK","OK"]
["35. Chirurgie pediatrică",null,39,0,0,0,0,0,0,0,0,0,0,0,0,0,0,0,0,0,0,0,0,0,0,0,0,0,0,0,"OK","OK","OK","OK"]
["36. Chirurgie plastică-microchirurgie reconstructivă",null,40,0,0,0,0,0,0,0,0,0,0,0,0,0,0,0,0,0,0,0,0,0,0,0,0,0,0,0,"OK","OK","OK","OK"]
["37. Chirurgie toracică",null,41,0,0,0,0,0,0,0,0,0,0,0,0,0,0,0,0,0,0,0,0,0,0,0,0,0,0,0,"OK","OK","OK","OK"]
["38. Chirurgie vasculară",null,42,0,0,0,0,0,0,0,0,0,0,0,0,0,0,0,0,0,0,0,0,0,0,0,0,0,0,0,"OK","OK","OK","OK"]
["39. Neurochirurgie",null,43,0,0,0,0,0,0,0,0,0,0,0,0,0,0,0,0,0,0,0,0,0,0,0,0,0,0,0,"OK","OK","OK","OK"]
["40. Obstetrică- ginecologie",null,44,0,0,0,0,0,0,0,0,0,0,0,0,0,0,0,0,0,0,0,0,0,0,0,0,0,0,0,"OK","OK","OK","OK"]
["41. Oftalmologie",null,45,0,0,0,0,0,0,0,0,0,0,0,0,0,0,0,0,0,0,0,0,0,0,0,0,0,0,0,"OK","OK","OK","OK"]
["42. Ortopedie pediatrică",null,46,0,0,0,0,0,0,0,0,0,0,0,0,0,0,0,0,0,0,0,0,0,0,0,0,0,0,0,"OK","OK","OK","OK"]
["43. Ortopedie şi traumatologie",null,47,0,0,0,0,0,0,0,0,0,0,0,0,0,0,0,0,0,0,0,0,0,0,0,0,0,0,0,"OK","OK","OK","OK"]
["44. O.R.L.",null,48,0,0,0,0,0,0,0,0,0,0,0,0,0,0,0,0,0,0,0,0,0,0,0,0,0,0,0,"OK","OK","OK","OK"]
["45. Urologie",null,49,0,0,0,0,0,0,0,0,0,0,0,0,0,0,0,0,0,0,0,0,0,0,0,0,0,0,0,"OK","OK","OK","OK"]
["46. Anatomie patologică",null,50,0,0,0,0,0,0,0,0,0,0,0,0,0,0,0,0,0,0,0,0,0,0,0,0,0,0,0,"OK","OK","OK","OK"]
["47. Epidemiologie",null,51,0,0,0,0,0,0,0,0,0,0,0,0,0,0,0,0,0,0,0,0,0,0,0,0,0,0,0,"OK","OK","OK","OK"]
["48. Igienă",null,52,0,0,0,0,0,0,0,0,0,0,0,0,0,0,0,0,0,0,0,0,0,0,0,0,0,0,0,"OK","OK","OK","OK"]
["49. Medicină de laborator",null,53,0,0,0,0,0,0,0,0,0,0,0,0,0,0,0,0,0,0,0,0,0,0,0,0,0,0,0,"OK","OK","OK","OK"]
["50. Medicină legală",null,54,0,0,0,0,0,0,0,0,0,0,0,0,0,0,0,0,0,0,0,0,0,0,0,0,0,0,0,"OK","OK","OK","OK"]
["51. Medicină nucleară",null,55,0,0,0,0,0,0,0,0,0,0,0,0,0,0,0,0,0,0,0,0,0,0,0,0,0,0,0,"OK","OK","OK","OK"]
["52. Radiologie – imagistică medicală",null,56,0,0,0,0,0,0,0,0,0,0,0,0,0,0,0,0,0,0,0,0,0,0,0,0,0,0,0,"OK","OK","OK","OK"]
["53. Sănătate publică şi management",null,57,0,0,0,0,0,0,0,0,0,0,0,0,0,0,0,0,0,0,0,0,0,0,0,0,0,0,0,"OK","OK","OK","OK"]
["II. DENTIŞTI -  TOTAL,                      din care:",null,58,0,0,0,0,0,0,0,0,0,0,0,0,0,0,0,0,0,0,0,0,0,0,0,0,0,0,0,"OK","OK","OK","OK"]
["           - rezidenţi",null,59,0,0,0,0,0,0,0,0,0,0,0,0,0,0,0,0,0,0,0,0,0,0,0,0,0,0,0,"OK","OK","OK","OK"]
["1. Chirurgie dento-alveolară",null,60,0,0,0,0,0,0,0,0,0,0,0,0,0,0,0,0,0,0,0,0,0,0,0,0,0,0,0,"OK","OK","OK","OK"]
["2. Ortodonţie şi ortopedie dento-facială",null,61,0,0,0,0,0,0,0,0,0,0,0,0,0,0,0,0,0,0,0,0,0,0,0,0,0,0,0,"OK","OK","OK","OK"]
["III. FARMACIŞTI – TOTAL,              din care:",null,62,0,0,0,0,0,0,0,0,0,0,0,0,0,0,0,0,0,0,0,0,0,0,0,0,0,0,0,"OK","OK","OK","OK"]
["          - rezidenţi",null,63,0,0,0,0,0,0,0,0,0,0,0,0,0,0,0,0,0,0,0,0,0,0,0,0,0,0,0,"OK","OK","OK","OK"]
["1. Farmacie clinică",null,64,0,0,0,0,0,0,0,0,0,0,0,0,0,0,0,0,0,0,0,0,0,0,0,0,0,0,0,"OK","OK","OK","OK"]
["2. Laborator farmaceutic",null,65,0,0,0,0,0,0,0,0,0,0,0,0,0,0,0,0,0,0,0,0,0,0,0,0,0,0,0,"OK","OK","OK","OK"]
["IV. FIZIOKINETOTERAPEUŢI - TOTAL, din care:",null,66,0,0,0,0,0,0,0,0,0,0,0,0,0,0,0,0,0,0,0,0,0,0,0,0,0,0,0,"OK","OK","OK","OK"]
["          - fizioterapeuţi  ",null,67,0,0,0,0,0,0,0,0,0,0,0,0,0,0,0,0,0,0,0,0,0,0,0,0,0,0,0,"OK","OK","OK","OK"]
["V. ASISTENŢI MEDICALI CU STUDII SUPERIOARE - TOTAL,       din care:",null,68,0,0,0,0,0,0,0,0,0,0,0,0,0,0,0,0,0,0,0,0,0,0,0,0,0,0,0,"OK","OK","OK","OK"]
["       - asistenţi medicali obstetrică- ginecologie (moaşe)",null,69,{"$f":"+E257+F257","v":0},{"$f":"+H257+K257+N257+Q257+T257+W257","v":0},0,0,{"$f":"+G257-I257","v":0},0,0,{"$f":"+J257-L257","v":0},0,0,{"$f":"+M257-O257","v":0},0,0,{"$f":"+P257-R257","v":0},0,0,{"$f":"+S257-U257","v":0},0,0,{"$f":"+V257-X257","v":0},0,0,{"$f":"+Y257-AA257","v":0},0,0,{"$f":"+AB257-AD257","v":0},0,"OK","OK","OK","OK"]
["VI. ALT PERSONAL SANITAR SUPERIOR (biologi, chimişti, logopezi, profesori CFM, psihologi)",null,70,{"$f":"+E258+F258","v":0},0,0,0,{"$f":"+G258-I258","v":0},0,0,{"$f":"+J258-L258","v":0},0,0,{"$f":"+M258-O258","v":0},0,0,{"$f":"+P258-R258","v":0},0,0,{"$f":"+S258-U258","v":0},0,0,{"$f":"+V258-X258","v":0},0,0,{"$f":"+Y258-AA258","v":0},0,0,{"$f":"+AB258-AD258","v":0},0,"OK","OK","OK","OK"]
["VII. ALT PERSONAL CU STUDII SUPERIOARE (economişti,jurişti, ingineri etc)",null,71,{"$f":"+E259+F259","v":0},0,0,0,{"$f":"+G259-I259","v":0},0,0,{"$f":"+J259-L259","v":0},0,0,{"$f":"+M259-O259","v":0},0,0,{"$f":"+P259-R259","v":0},0,0,{"$f":"+S259-U259","v":0},0,0,{"$f":"+V259-X259","v":0},0,0,{"$f":"+Y259-AA259","v":0},0,0,{"$f":"+AB259-AD259","v":0},0,"OK","OK","OK","OK"]